program: Gaussian 09
title: 000118673
version: EM64L-G09RevD.01
frameworkgroup: C1[X(C20H12ClNO4)]
method: RPBEPBE
basis: SDD
operation: Freq
keyword: #p
keyword: freq=noraman
keyword: PBEPBE/SDD
title: #p freq=noraman PBEPBE/SDD
converged: NO YES NO NO
title: Mulliken charges:
elementType: Cl O O O O N C C C C C C C C C C C C C C C C C C C C H H H H H H H H H H H H
charge: 0.071842 -0.320074 -0.352294 -0.291457 -0.336232 -0.640002 0.215522 0.158181 0.290757 0.300436 -0.177845 0.102893 -0.091834 0.149270 0.313878 -0.612992 -0.389766 -0.377342 -0.225021 -0.227655 0.383493 -0.327959 -0.383148 -0.208117 -0.192071 -0.247253 0.295138 0.293828 0.239756 0.240598 0.341123 0.389112 0.394868 0.260339 0.260780 0.232283 0.233452 0.233515
chargesum: 0.00000
title: Mulliken charges with hydrogens summed into heavy atoms:
elementType: Cl O O O O N C C C C C C C C C C C C C C C C C C C C
charge: 0.071842 -0.320074 0.042574 -0.291457 -0.336232 0.090232 0.215522 0.158181 0.290757 0.300436 -0.177845 0.102893 -0.091834 0.149270 0.313878 -0.612992 -0.094628 -0.083514 0.014735 0.012943 0.383493 -0.067620 -0.122369 0.024166 0.041381 -0.013738
polarizability: 4.87570806e+02 -7.85250260e+00 2.43789675e+02 2.53465138e+01 1.33591861e+01 1.40051672e+02
1716.lowfreq: -0.0015 -0.0006 0.0001 4.0838 6.8812 10.6984 20.9902 34.8148 41.2155
frequency: 20.9251 34.7341 41.2090 54.5759 86.2726 118.5379 133.4072 161.3146 166.1408 166.8622 183.3216 224.3210 234.0602 239.9994 286.9672 314.9991 326.7060 339.1630 353.1634 390.5099 409.4195 411.7852 424.7653 427.5358 447.2071 452.1177 478.4684 487.5626 513.7051 530.6633 538.9412 588.2678 596.1729 607.0474 628.2757 662.7222 682.3335 685.2993 687.2595 697.6444 728.4574 733.2210 757.0440 777.0838 802.6758 804.0948 820.9331 831.8493 848.9401 863.3921 904.5800 911.6024 931.2662 968.4613 975.1933 986.8706 989.4928 997.3954 1013.7508 1015.3019 1019.9431 1032.1602 1035.4234 1079.4729 1087.0857 1125.5506 1148.0706 1164.1110 1171.9917 1172.7100 1185.2707 1200.3991 1251.6825 1264.1667 1300.5877 1310.1785 1342.8666 1353.7026 1385.2567 1387.8127 1407.1045 1416.6264 1441.5680 1444.0777 1458.6635 1468.6129 1470.1595 1500.8907 1530.4585 1552.4965 1573.3637 1592.1907 1597.7493 1607.9466 1609.3924 1617.4384 2328.7302 3134.7757 3136.9389 3142.9393 3152.8546 3155.6486 3164.7620 3165.9068 3173.1913 3176.4839 3292.8970 3614.1157
redmass: 6.3688 5.2847 4.5258 9.1628 7.3280 6.2736 6.7191 8.1723 8.2899 8.5220 6.3032 5.6430 6.8486 6.7598 13.4638 6.5445 5.5367 8.6070 5.0444 8.6343 2.9009 7.1082 5.7887 4.4257 9.8797 6.4448 3.5873 8.2755 5.7428 7.9845 8.1417 7.1452 1.1478 6.7302 7.6667 6.5009 6.1450 5.8578 2.7754 4.7416 3.1669 6.2096 1.5684 6.8188 2.9776 2.4589 1.1321 1.2504 3.4874 7.7383 1.6114 4.7874 1.7223 1.3744 5.8456 4.8745 1.3977 1.3888 5.1543 1.3652 2.1642 2.0903 1.0584 1.4989 2.4306 3.7909 1.9129 1.7845 1.1164 1.1138 1.5807 3.0773 2.5378 1.9039 4.8426 1.3490 5.3529 4.3778 7.8580 7.6936 7.1498 3.4828 4.4006 2.3650 3.6932 2.8078 2.2364 5.9877 6.7872 2.4221 2.5980 3.0390 5.5758 6.7076 6.6682 7.5491 1.0829 1.0851 1.0864 1.0888 1.0904 1.0935 1.0946 1.0965 1.1000 1.1008 1.0606 1.0907
irintensity: 0.8425 0.4564 0.1088 1.2634 1.5577 0.1063 1.9498 0.1034 0.2249 0.8462 0.5872 0.3981 2.1427 0.0688 2.0416 5.3533 0.8852 4.6665 13.9160 1.7712 0.1262 24.6718 3.1138 2.4694 21.3384 1.4453 14.9194 14.3922 3.3733 3.9564 5.9140 2.1317 137.7202 4.8788 13.0753 3.1865 6.8002 3.0383 13.0806 19.4831 23.8381 4.7504 78.7709 25.0398 32.2740 66.0795 106.2570 2.8262 0.7390 5.1267 0.1655 18.3719 0.6958 0.6685 42.4236 7.2491 0.9506 3.4629 42.3784 0.3216 7.0877 10.1972 128.3475 12.4437 11.9249 20.5633 2.6123 245.3664 36.6733 5.6814 130.2336 247.1055 85.7554 13.4641 567.5130 9.4837 298.5852 37.9682 6.4329 3.9524 13.4317 105.8534 286.9161 8.7786 33.8731 10.5811 121.5406 408.3207 80.7340 56.8617 11.4590 77.8208 89.8630 18.9157 27.5749 21.3131 125.4284 2.8511 4.2156 6.9533 10.8524 24.5361 1.3568 14.9672 32.6317 11.1507 60.8431 125.1566
temp: 298.150 k
press: 1.00000 atm
elementType: 17 8 8 8 8 7 6 6 6 6 6 6 6 6 6 6 6 6 6 6 6 6 6 6 6 6 1 1 1 1 1 1 1 1 1 1 1 1
symmnumber: 1
zpe: 708443.0 jmol-1
zpe.correction: 0.269832 hartree
zpe.thermalcorrener: 0.290172 hartree
zpe.thermalcorrenthalpy: 0.291116 hartree
zpe.thermalcorrgfe: 0.219963 hartree
zpe.sumelectzpe: -1583.302936 hartree
zpe.sumelectthermal: -1583.282595 hartree
zpe.sumelectthermalent: -1583.281651 hartree
zpe.sumelectthermalfe: -1583.352804 hartree
dipole: -0.5887 -2.9696 1.0270
dipole: 3.1969
quadrupole: -118.2310 -166.7517 -152.4719
quadrupole: 4.4782 0.7957 2.2500
quadrupole: 27.5872 -20.9335 -6.6537 4.4782 0.7957 2.2500
hfenergy: -1583.5727674 hartree
pointgroup: C01 [X(C20H12Cl1N1O4)]
dipole: 0.2647359 -1.2083037 -0.2277152 debye
polarizability: 487.6958204|18.9869101|238.3195089|14.8133324|-28.2383159|145.396823 unknown
InChI: InChI=1S/C20H12ClNO4/c21-15-19(25)14-13(16(22)20(15)26-10-6-2-1-3-7-10)17(23)11-8-4-5-9-12(11)18(14)24/h1-9,25H,22H2
charge 0 multiplicity 1
38 atoms
Cl 2.563306 2.564583 0.24677
O  2.76126 -0.45078 1.00498
O  -0.30752 3.077463 -0.391578
O  -1.830934 -2.731295 0.838953
O  -2.705395 2.544584 -0.632797
N  0.735898 -2.226576 1.09011
C  -0.911044 -0.536463 0.413531
C  -1.156997 0.827807 0.027833
C  -3.384193 -1.013826 0.156587
C  -3.621538 0.342001 -0.22562
C  -2.014359 -1.496669 0.493659
C  0.42639 -0.948764 0.716086
C  -2.501643 1.29705 -0.291161
C  -0.090192 1.780408 -0.042163
C  1.49827 0.022323 0.616687
C  1.242023 1.351237 0.272931
C  -4.472685 -1.919317 0.21706
C  -4.937269 0.770625 -0.540064
C  -5.775836 -1.486989 -0.096949
C  -6.00942 -0.138566 -0.476767
C  3.866407 -0.451662 0.090773
C  3.694556 -0.413234 -1.308834
C  5.139442 -0.567405 0.683539
C  4.841493 -0.486924 -2.130983
C  6.273446 -0.645444 -0.153915
C  6.13036 -0.603989 -1.561336
H  -4.2647 -2.952004 0.513347
H  -5.085923 1.81567 -0.828345
H  -6.612243 -2.19245 -0.047596
H  -7.024312 0.193379 -0.719866
H  1.698691 -2.457374 1.331143
H  -0.055036 -2.890254 1.14419
H  -1.358786 3.151652 -0.571761
H  2.695531 -0.32396 -1.747712
H  5.22528 -0.586073 1.773917
H  4.722066 -0.454544 -3.21936
H  7.268566 -0.732641 0.295424
H  7.01324 -0.660578 -2.206316
