program: Gaussian 09
title: 000118519
version: EM64L-G09RevD.01
frameworkgroup: C1[X(C8H20N2OS)]
method: RPBEPBE
basis: SDD
operation: Freq
keyword: #p
keyword: freq=noraman
keyword: PBEPBE/SDD
title: #p freq=noraman PBEPBE/SDD
converged: YES YES NO NO
title: Mulliken charges:
elementType: S O N N C C C C C C C C H H H H H H H H H H H H H H H H H H H H
charge: 0.764436 -0.596433 -0.337789 -0.340801 -0.355424 -0.331077 -0.296613 -0.327772 -0.665979 -0.656377 -0.664095 -0.677227 0.224133 0.245363 0.192818 0.276097 0.255531 0.210259 0.226564 0.223881 0.219477 0.219962 0.220761 0.226985 0.210075 0.215805 0.206775 0.230140 0.214745 0.223749 0.226652 0.215377
chargesum: 0.00000
title: Mulliken charges with hydrogens summed into heavy atoms:
elementType: S O N N C C C C C C C C
charge: 0.764436 -0.596433 -0.337789 -0.340801 0.114073 0.137838 0.169177 0.122673 -0.005779 -0.003512 -0.012434 -0.011449
polarizability: 1.60731577e+02 -3.26666491e-01 1.21210413e+02 7.27707287e-02 8.41111031e-02 1.21123125e+02
1716.lowfreq: -19.6805 -12.3565 -7.8473 -0.0018 0.0007 0.0010 27.1085 34.3432 54.0713
frequency: 24.2462 33.6637 53.8719 65.5852 73.3606 98.5548 124.7116 133.9668 172.2588 177.4199 199.5076 208.9665 217.0345 238.4260 261.8032 269.4572 297.5957 310.1342 359.0117 374.0712 425.5104 456.4184 476.6305 508.0674 524.1453 755.8361 773.2865 777.1397 798.6685 829.7575 835.1234 840.4368 915.5699 929.1256 998.9257 1028.1941 1058.6932 1061.7169 1067.1655 1082.5837 1090.2361 1103.1281 1140.2205 1166.3962 1167.2554 1174.0700 1264.9252 1276.0166 1284.9552 1303.8730 1332.6491 1353.0871 1355.3682 1357.9787 1381.3737 1382.8780 1384.3800 1391.9580 1454.0240 1455.1413 1464.6230 1465.2549 1466.9681 1467.9094 1472.8067 1477.3310 1478.8875 1481.2449 1484.8467 1488.3491 2926.3730 2927.2985 2945.5337 2980.6359 2981.5431 2982.8699 2983.6971 2989.4755 3008.6017 3020.1611 3040.6247 3044.3084 3073.8998 3076.5086 3077.7249 3083.8552 3084.6109 3093.2294 3093.9500 3094.1031
redmass: 3.7074 3.2680 2.7480 2.2485 1.9107 2.4826 2.4059 2.9268 1.6485 2.5431 1.6486 1.1380 1.6975 1.7607 2.9569 1.8858 2.1539 2.6949 3.3542 4.3163 5.9606 4.0849 3.8517 2.6913 3.3901 1.9334 1.5496 1.2605 1.1350 1.3987 1.5658 15.7069 2.0326 2.0731 2.2897 2.5388 2.4731 2.4097 1.9892 1.8999 1.6414 2.0852 2.1026 2.0179 2.2721 2.3314 1.1257 1.1778 1.1585 1.1414 1.2223 1.2478 1.3088 1.2911 1.2074 1.2065 1.2079 1.2238 1.0667 1.0654 1.0535 1.0509 1.0462 1.0470 1.0564 1.0457 1.0545 1.0505 1.0559 1.0716 1.0671 1.0634 1.0661 1.0416 1.0353 1.0404 1.0518 1.0358 1.0955 1.0920 1.0998 1.0945 1.0996 1.0986 1.0989 1.1006 1.0992 1.1002 1.1006 1.1006
irintensity: 1.1549 0.6692 0.6059 0.2526 0.4554 0.5023 4.4949 6.7323 3.1061 1.6497 1.4092 0.5420 3.5751 0.4808 0.7171 2.6286 0.7104 0.0656 0.4933 18.5471 25.4337 0.3998 5.1954 18.3506 11.2470 36.7169 13.1865 4.6428 4.0473 1.6326 2.8198 59.1106 4.7168 0.3673 38.8617 22.7979 3.2854 15.1506 4.5182 0.9829 11.6538 28.5337 12.5907 13.9667 12.6691 13.2730 1.7311 13.2969 8.9280 30.0613 4.5009 7.2333 8.5014 2.7812 29.7605 5.7114 17.4869 25.7510 1.3295 9.2832 12.4284 5.8489 5.8455 24.4621 7.0282 6.4425 15.3924 9.9277 12.4069 6.7006 101.1511 49.3249 59.5123 19.9787 31.3067 24.0092 53.2068 23.5539 4.3336 12.5315 2.8028 1.2091 34.8380 34.6010 39.3566 61.8906 20.6851 48.1450 17.1013 46.3045
temp: 298.150 k
press: 1.00000 atm
elementType: 16 8 7 7 6 6 6 6 6 6 6 6 1 1 1 1 1 1 1 1 1 1 1 1 1 1 1 1 1 1 1 1
symmnumber: 1
zpe: 723225.0 jmol-1
zpe.correction: 0.275462 hartree
zpe.thermalcorrener: 0.292718 hartree
zpe.thermalcorrenthalpy: 0.293662 hartree
zpe.thermalcorrgfe: 0.229495 hartree
zpe.sumelectzpe: -898.503479 hartree
zpe.sumelectthermal: -898.486223 hartree
zpe.sumelectthermalent: -898.485279 hartree
zpe.sumelectthermalfe: -898.549446 hartree
dipole: 0.1866 -0.6790 -2.9758
dipole: 3.0580
quadrupole: -73.5645 -80.8222 -92.7263
quadrupole: 0.5510 1.2923 0.0122
quadrupole: 8.8065 1.5488 -10.3553 0.5510 1.2923 0.0122
hfenergy: -898.7789407 hartree
pointgroup: C01 [X(C8H20N2O1S1)]
dipole: -0.1045809 -0.3128795 -1.1569948 debye
polarizability: 160.6072712|-2.1919395|121.2399398|-0.4686438|-0.0562972|121.2179035 unknown
InChI: InChI=1S/C8H20N2OS/c1-5-9(6-2)12(11)10(7-3)8-4/h5-8H2,1-4H3
charge 0 multiplicity 1
32 atoms
S  -0.075508 1.10458 0.412894
O  0.15235 1.115106 2.048201
N  1.299559 -0.10528 -0.172863
N  -1.445475 -0.118663 -0.093543
C  1.499578 0.023464 -1.641362
C  2.488966 -0.047683 0.710895
C  -1.369654 -1.377868 0.709867
C  -2.777674 0.563424 0.004533
C  2.215275 1.299563 -2.148373
C  3.175576 -1.428391 0.764318
C  -1.976315 -2.554972 -0.079267
C  -2.930763 1.716967 -1.001366
H  2.069259 -0.874362 -1.953522
H  0.498813 -0.06602 -2.103539
H  3.220885 0.73015 0.39996
H  2.118477 0.223664 1.719365
H  -0.298355 -1.576459 0.891348
H  -1.872485 -1.260655 1.694338
H  -3.526763 -0.218435 -0.225098
H  -2.986749 0.91047 1.042092
H  1.654267 2.209711 -1.867166
H  3.239195 1.38856 -1.743507
H  2.292209 1.27461 -3.251091
H  2.46327 -2.197348 1.110102
H  3.559625 -1.735068 -0.225988
H  4.030492 -1.397544 1.465278
H  -3.047593 -2.400338 -0.303678
H  -1.440094 -2.689835 -1.034441
H  -1.887617 -3.486614 0.509925
H  -2.245179 2.554178 -0.780131
H  -2.722979 1.361901 -2.025879
H  -3.962293 2.112285 -0.970302
