program: Gaussian 09
title: 000118478
version: EM64L-G09RevD.01
frameworkgroup: C1[X(C12H18O)]
method: RPBEPBE
basis: SDD
operation: Freq
keyword: #pfreq=noraman
keyword: PBEPBE/SDD
title: #p freq=noraman PBEPBE/SDD
converged: YES YES NO NO
title: Mulliken charges:
elementType: O C C C C C C C C C C C C H H H H H H H H H H H H H H H H H H
charge: -0.268240 -0.339999 -0.397623 -0.351153 -0.306053 -0.693275 0.350818 -0.341884 -0.380200 0.440495 -0.423147 -0.332316 -0.810120 0.185603 0.185492 0.211350 0.211210 0.197615 0.197382 0.201997 0.202461 0.209696 0.209703 0.218142 0.244982 0.246894 0.225018 0.228110 0.227797 0.227357 0.221885
chargesum: 0.00000
title: Mulliken charges with hydrogens summed into heavy atoms:
elementType: O C C C C C C C C C C C C
charge: -0.268240 0.031096 0.024938 0.043844 0.098405 -0.055733 0.350818 -0.096901 -0.133306 0.440495 -0.198129 -0.104205 -0.133081
polarizability: 1.98677164e+02 1.37699909e+00 1.25343302e+02 -6.61671997e-01 3.50302015e-01 8.19242537e+01
1716.lowfreq: -0.0006 -0.0004 0.0003 5.8752 9.7730 16.3548 29.0658 34.3448 54.2440
frequency: 27.8928 34.3106 54.1826 57.1304 81.3410 128.1943 146.2470 161.3513 162.6727 219.0188 231.9238 291.5998 329.8013 358.2381 414.5101 416.9476 470.6804 508.2804 537.4665 634.9623 711.1973 731.7490 732.1284 773.5256 809.3956 815.6390 828.2968 859.0454 891.9753 930.3017 962.0370 970.9408 974.8936 986.9070 1006.1285 1019.5797 1046.3022 1072.0676 1076.3729 1119.7580 1127.8074 1146.1708 1179.1817 1202.4732 1216.8798 1225.3602 1253.6066 1261.1164 1285.2225 1294.1247 1304.9423 1319.7628 1356.2390 1368.8130 1384.2044 1392.6001 1398.5357 1415.8016 1467.5832 1468.5097 1469.8910 1475.9566 1477.1906 1478.6513 1483.7663 1490.1543 1504.5091 1585.7409 1627.0467 2939.7246 2955.7186 2971.0233 2972.0296 2973.6055 2994.3119 2995.6750 2996.3430 3025.6387 3048.2842 3060.6306 3070.9447 3072.9502 3079.1545 3119.5337 3122.0405 3158.2498 3162.5306
redmass: 1.6699 1.6124 1.9082 3.0340 3.2314 1.9119 2.2991 3.5166 3.5295 4.4408 1.1223 3.0345 4.2725 2.8285 2.9378 3.7685 3.8358 2.4544 4.6445 6.8062 2.9708 1.2380 3.0647 1.1187 1.4075 5.8972 1.3634 1.1698 1.9498 1.3228 1.3425 1.1499 3.1673 1.8217 2.6507 3.6205 1.5260 2.4006 2.5197 1.2903 2.4877 1.4368 1.2630 1.4553 2.1004 5.5329 1.2950 1.2400 1.0610 1.1177 1.2921 1.3582 1.5821 3.2891 1.6542 1.2318 1.2563 3.5647 1.0690 1.0814 1.0456 1.0845 1.0990 1.0423 1.1048 1.1260 2.2920 6.4817 6.4238 1.0550 1.0588 1.0579 1.0372 1.0378 1.0596 1.1033 1.1015 1.1034 1.0977 1.1046 1.1011 1.0992 1.0984 1.0894 1.0891 1.0940 1.0953
irintensity: 0.4260 0.0741 0.0797 0.0796 1.5925 0.1224 1.8415 0.5902 0.9476 0.8343 0.0024 0.6529 5.0515 1.0173 0.0192 0.6290 0.2909 20.8377 6.7043 0.1482 0.6893 12.0416 13.6576 1.3788 43.2320 4.6620 30.9917 0.3712 15.2201 0.6694 0.8460 0.8458 56.5318 10.1008 7.1555 8.5914 11.1091 21.1269 3.4761 16.4176 6.4582 0.4207 67.6294 0.4569 127.6550 110.1814 8.0656 0.0051 0.1103 1.0072 0.9864 0.2994 2.6522 1.4962 17.2447 16.4202 11.2520 3.4135 0.0734 1.8095 12.1188 21.7209 12.2806 12.8422 11.0817 48.1471 116.5344 14.0727 36.1720 29.6561 17.0833 57.5356 53.9476 29.3725 40.7523 29.5467 1.2314 14.7896 24.8045 35.6478 118.2628 53.1870 20.3926 18.4205 26.2003 20.6545 3.4401
temp: 298.150 k
press: 1.00000 atm
elementType: 8 6 6 6 6 6 6 6 6 6 6 6 6 1 1 1 1 1 1 1 1 1 1 1 1 1 1 1 1 1 1
symmnumber: 1
zpe: 705588.7 jmol-1
zpe.correction: 0.268745 hartree
zpe.thermalcorrener: 0.283333 hartree
zpe.thermalcorrenthalpy: 0.284277 hartree
zpe.thermalcorrgfe: 0.225238 hartree
zpe.sumelectzpe: -542.287964 hartree
zpe.sumelectthermal: -542.273375 hartree
zpe.sumelectthermalent: -542.272431 hartree
zpe.sumelectthermalfe: -542.331470 hartree
dipole: 0.7690 -1.2431 0.0077
dipole: 1.4618
quadrupole: -70.4942 -77.2390 -82.9684
quadrupole: -0.4492 -0.1592 0.1434
quadrupole: 6.4063 -0.3385 -6.0678 -0.4492 -0.1592 0.1434
hfenergy: -542.5567083 hartree
pointgroup: C01 [X(C12H18O1)]
dipole: -0.302527 -0.4852891 0.0610075 debye
polarizability: 198.6776672|-1.4427157|124.5065783|-0.4501432|-5.9786167|82.7604736 unknown
InChI: InChI=1S/C12H18O/c1-3-4-5-10-13-12-8-6-11(2)7-9-12/h6-9H,3-5,10H2,1-2H3
charge 0 multiplicity 1
31 atoms
O  -0.259167 0.803452 -0.19628
C  -3.864674 -0.437627 -0.055838
C  -2.661148 0.527157 -0.161817
C  -5.224634 0.290062 -0.159624
C  -1.322816 -0.206798 -0.055038
C  -6.428222 -0.672146 -0.065382
C  1.073713 0.359251 -0.146467
C  1.468889 -0.987039 0.041515
C  2.059626 1.366447 -0.300923
C  3.847824 -0.32095 -0.081627
C  2.847402 -1.308815 0.071358
C  3.423309 1.024255 -0.268138
C  5.325657 -0.673659 -0.049965
H  -3.819943 -0.988283 0.907298
H  -3.800835 -1.203478 -0.85715
H  -2.716514 1.291155 0.637277
H  -2.694713 1.068596 -1.126808
H  -5.292313 1.051174 0.64393
H  -5.267046 0.845509 -1.118469
H  -1.223231 -0.96821 -0.857846
H  -1.226035 -0.716177 0.92735
H  -6.399489 -1.423405 -0.877126
H  -6.425976 -1.218151 0.896997
H  -7.387467 -0.128255 -0.142569
H  0.729426 -1.783771 0.164979
H  1.733231 2.401234 -0.445005
H  3.143229 -2.354925 0.217896
H  4.175025 1.814261 -0.389673
H  5.825724 -0.409008 -1.001156
H  5.85462 -0.130395 0.756067
H  5.479048 -1.753761 0.118635
