program: Gaussian 09
title: 000118416
version: EM64L-G09RevD.01
frameworkgroup: C1[X(C10H12NO3P)]
method: RPBEPBE
basis: SDD
operation: Freq
keyword: #p
keyword: freq=noraman
keyword: PBEPBE/SDD
title: #p freq=noraman PBEPBE/SDD
converged: YES YES NO NO
title: Mulliken charges:
elementType: P O O O N C C C C C C C C C C H H H H H H H H H H H H
charge: 1.265329 -0.552656 -0.486658 -0.604258 -0.024329 -0.676992 -0.629932 0.380026 -0.317649 -0.368751 -0.356621 -0.345555 0.394866 -0.493999 -0.254025 0.289921 0.258711 0.234071 0.235000 0.253464 0.304947 0.259860 0.260117 0.259653 0.214899 0.255080 0.245480
chargesum: 0.00000
title: Mulliken charges with hydrogens summed into heavy atoms:
elementType: P O O O N C C C C C C C C C C
charge: 1.265329 -0.552656 -0.486658 -0.604258 -0.024329 -0.128360 0.092603 0.380026 -0.012701 -0.108890 -0.096503 -0.085902 0.394866 0.221460 -0.254025
polarizability: 2.33770185e+02 1.61852066e+00 1.21447651e+02 -1.03372750e+01 -1.34099122e+01 1.00354305e+02
1716.lowfreq: -5.9513 -0.0007 0.0006 0.0016 6.7249 16.9047 26.2490 30.3725 51.5303
frequency: 25.8054 29.8622 51.3468 61.5186 81.6247 94.9466 125.8804 139.5770 160.8261 174.4724 187.9148 234.4102 244.4905 255.6040 272.9080 323.6649 369.3924 407.1152 423.4423 464.1604 479.6201 544.1550 556.6115 565.7169 597.9013 646.1251 684.6104 730.4433 740.7954 778.2277 836.2411 837.9744 860.2615 966.1970 968.4631 982.0789 986.9602 1006.3709 1024.9118 1055.2128 1081.2797 1109.9552 1116.1766 1126.5494 1178.6592 1196.9749 1214.9975 1241.3543 1282.9382 1306.0443 1356.4836 1407.4983 1421.2716 1424.2884 1435.1459 1465.2746 1466.9850 1472.9656 1486.6715 1488.9016 1566.8017 1611.3893 2176.7813 2972.8144 2997.9985 3033.3814 3073.6119 3088.3437 3097.2219 3111.1289 3125.9756 3151.1490 3155.6633 3168.9877 3177.9797
redmass: 4.6390 4.4149 2.7386 3.0110 3.6176 4.0003 2.5069 1.8653 3.6077 2.6805 2.3342 3.3827 3.8841 5.6632 3.4815 8.4117 4.8519 2.9967 7.5837 5.4646 7.1463 7.6105 3.7692 5.3525 8.4479 7.4632 5.2911 3.8609 7.4673 1.2389 6.7077 1.3138 1.5479 2.1897 2.6101 1.3505 1.8029 2.9425 2.1467 2.0234 2.8228 1.2461 1.3535 1.2936 1.5588 2.5808 2.9004 1.2110 1.3351 1.2713 5.5730 1.1802 3.6655 1.1107 1.0934 1.0511 1.0598 1.0361 1.0701 2.2897 7.4147 6.1784 12.6288 1.0327 1.0358 1.0592 1.1018 1.1019 1.1003 1.1027 1.1024 1.0903 1.0889 1.0975 1.0979
irintensity: 0.9268 1.1395 1.7097 4.7400 0.2351 2.0577 2.3379 2.8452 6.9647 4.1399 0.6832 3.7894 27.2634 0.6146 1.5749 24.3044 2.7034 0.2622 22.2327 3.9698 48.7883 3.6535 10.4963 22.3838 123.5878 0.8371 62.2138 0.8820 162.1055 27.9354 216.5700 15.9743 84.3252 57.7830 71.4690 0.4995 31.4103 15.4478 17.0108 32.5647 86.3631 0.2084 14.4608 0.8079 173.5738 24.7886 206.0593 5.6470 2.4187 0.6335 6.0679 18.1245 3.9291 2.1516 11.5388 4.8240 12.9324 15.8966 25.5051 169.7248 10.4156 135.8367 60.2683 48.5344 22.9768 7.0756 39.6567 4.7571 12.9090 15.5262 11.7752 3.0576 3.4606 3.0819 3.1282
temp: 298.150 k
press: 1.00000 atm
elementType: 15 8 8 8 7 6 6 6 6 6 6 6 6 6 6 1 1 1 1 1 1 1 1 1 1 1 1
symmnumber: 1
zpe: 530947.5 jmol-1
zpe.correction: 0.202227 hartree
zpe.thermalcorrener: 0.218860 hartree
zpe.thermalcorrenthalpy: 0.219804 hartree
zpe.thermalcorrgfe: 0.155997 hartree
zpe.sumelectzpe: -1008.772941 hartree
zpe.sumelectthermal: -1008.756308 hartree
zpe.sumelectthermalent: -1008.755364 hartree
zpe.sumelectthermalfe: -1008.819172 hartree
dipole: 6.7496 4.5771 -2.0539
dipole: 8.4098
quadrupole: -118.3106 -93.5491 -95.5336
quadrupole: 5.7958 -2.2533 1.2085
quadrupole: -15.8462 8.9154 6.9308 5.7958 -2.2533 1.2085
hfenergy: -1008.9751682 hartree
pointgroup: C01 [X(C10H12N1O3P1)]
dipole: -2.6708851 -1.5188117 1.2275328 debye
polarizability: 234.3098769|6.1040414|116.6172066|0.191893|-16.1517107|104.6450578 unknown
InChI: InChI=1S/C10H12NO3P/c1-3-15(12,13-2)14-10-6-4-9(8-11)5-7-10/h4-7H,3H2,1-2H3
charge 0 multiplicity 1
27 atoms
P  -2.425441 0.380354 -0.283214
O  -1.104597 -0.771979 -0.016529
O  -2.554355 1.217401 1.236169
O  -2.25234 1.418984 -1.469567
N  5.667025 0.34073 -0.161499
C  -3.825941 -0.850087 -0.391164
C  -5.187482 -0.133126 -0.490549
C  0.271654 -0.463054 -0.073674
C  0.785616 0.724398 -0.652137
C  1.13458 -1.444928 0.469236
C  2.178548 0.925664 -0.667997
C  2.524526 -1.238624 0.442918
C  3.061117 -0.047436 -0.122805
C  -2.471149 0.479713 2.515361
C  4.483533 0.165184 -0.144982
H  -3.621791 -1.463372 -1.285502
H  -3.760594 -1.507602 0.492307
H  -5.99334 -0.881636 -0.584094
H  -5.391747 0.48239 0.403144
H  -5.227615 0.527374 -1.373693
H  0.109981 1.466253 -1.089422
H  0.70395 -2.354474 0.897462
H  2.588832 1.838762 -1.110085
H  3.199562 -1.99264 0.859134
H  -3.321065 -0.219245 2.637887
H  -2.521991 1.259707 3.289394
H  -1.517278 -0.07081 2.595702
