program: Gaussian 09
title: 000118392
version: EM64L-G09RevD.01
frameworkgroup: C1[X(C12H14O)]
method: RPBEPBE
basis: SDD
operation: Freq
keyword: #pfreq=noraman
keyword: PBEPBE/SDD
title: #p freq=noraman PBEPBE/SDD
converged: YES YES NO NO
title: Mulliken charges:
elementType: O C C C C C C C C C C C C H H H H H H H H H H H H H H
charge: -0.235003 -0.563642 -0.483146 0.500878 -0.404311 -0.408726 -0.065837 -0.226264 -0.225635 -0.241707 -0.317245 0.195216 -0.780463 0.224128 0.217343 0.227158 0.227692 0.263418 0.231932 0.232137 0.225111 0.224835 0.228671 0.230125 0.234650 0.233910 0.254774
chargesum: 0.00000
title: Mulliken charges with hydrogens summed into heavy atoms:
elementType: O C C C C C C C C C C C C
charge: -0.235003 -0.122171 -0.028296 0.500878 -0.172379 -0.176588 0.197581 -0.001153 -0.000800 -0.013036 -0.087120 0.195216 -0.057130
polarizability: 2.01238234e+02 -3.85938231e+00 1.25748530e+02 -1.32335211e+01 1.09890625e+00 7.65405590e+01
1716.lowfreq: -14.8316 -3.9330 -0.0007 -0.0006 -0.0003 2.9921 12.7943 30.8261 45.1998
frequency: 12.6718 30.7606 45.1710 55.7694 98.0819 110.6023 133.2793 185.7753 236.0135 304.1875 336.1980 394.7071 402.7774 411.5508 502.8806 561.4681 572.4853 610.8781 617.6014 705.2346 757.4181 768.7943 806.2955 843.9490 853.4065 875.7835 916.3624 944.6309 975.6074 979.7154 989.8766 993.7224 999.0479 1010.0068 1026.2242 1027.4759 1062.3573 1101.9196 1149.7811 1172.3389 1186.9031 1196.7387 1216.8687 1249.5720 1263.9501 1290.5791 1310.3860 1326.7237 1335.0406 1367.0541 1382.2757 1440.6157 1442.2332 1455.2016 1458.8181 1481.3201 1483.6508 1583.8877 1592.9077 1614.1647 1658.6519 2969.3878 2977.8895 2991.5325 3033.8224 3058.5554 3060.1463 3084.4571 3108.3455 3113.5177 3114.6159 3124.3836 3131.6044 3143.6627 3162.4782
redmass: 3.4184 4.1981 3.2314 4.1907 1.0713 5.3937 2.6094 2.9945 4.0038 2.9395 2.4064 3.8966 2.8259 2.8278 3.1695 3.0034 3.6439 3.8376 6.3312 1.7490 1.8834 1.2733 3.0266 1.7230 1.2700 3.2350 1.4461 1.9832 1.3925 1.4426 6.1746 1.4404 1.9723 1.7558 2.1896 1.8263 1.7174 1.6583 1.3480 1.0527 1.1165 1.9891 2.4999 1.3491 1.2696 1.3254 1.4871 1.2814 1.4818 1.2690 7.8894 2.1705 1.0863 1.0502 1.1080 1.2710 1.8194 7.6451 6.0358 6.1818 6.2106 1.0617 1.0375 1.0602 1.0973 1.1028 1.0963 1.0914 1.0909 1.0877 1.0868 1.0993 1.0904 1.0957 1.1015
irintensity: 1.7273 1.3711 0.1475 2.7980 0.1636 1.4626 0.6007 3.2399 0.8086 1.0638 0.7161 5.7202 0.0485 1.1202 15.7214 10.1732 4.1638 9.0435 0.1099 52.7770 40.0232 10.7246 5.7852 0.2611 0.0597 2.1509 2.6439 48.6217 0.3882 15.4682 0.3201 1.5095 13.2746 29.8613 6.4273 1.3274 8.7691 11.1028 8.1799 0.0979 0.3118 53.2660 0.1780 51.5354 6.4301 10.9239 36.5978 2.5523 31.2917 75.3480 0.0906 7.2348 28.7028 19.8720 8.9145 17.0423 12.1862 203.5252 1.4186 9.2360 122.6417 10.2606 3.4296 33.1003 3.9504 22.8365 15.5425 7.5515 15.3726 8.9769 10.3207 20.3084 8.7119 43.6181 25.1145
temp: 298.150 k
press: 1.00000 atm
elementType: 8 6 6 6 6 6 6 6 6 6 6 6 6 1 1 1 1 1 1 1 1 1 1 1 1 1 1
symmnumber: 1
zpe: 586138.8 jmol-1
zpe.correction: 0.223248 hartree
zpe.thermalcorrener: 0.236576 hartree
zpe.thermalcorrenthalpy: 0.237520 hartree
zpe.thermalcorrgfe: 0.179907 hartree
zpe.sumelectzpe: -539.928613 hartree
zpe.sumelectthermal: -539.915286 hartree
zpe.sumelectthermalent: -539.914342 hartree
zpe.sumelectthermalfe: -539.971955 hartree
dipole: 1.9953 2.3864 -1.1691
dipole: 3.3231
quadrupole: -83.2294 -73.3614 -81.0193
quadrupole: -12.6769 2.6000 2.1169
quadrupole: -4.0260 5.8420 -1.8160 -12.6769 2.6000 2.1169
hfenergy: -540.1518616 hartree
pointgroup: C01 [X(C12H14O1)]
dipole: 0.7934765 0.9435317 -0.4352662 debye
polarizability: 201.3169889|-4.0793315|125.7271128|-12.679487|2.2464383|76.4832209 unknown
InChI: InChI=1S/C12H14O/c1-11(13)7-5-6-10-12-8-3-2-4-9-12/h2-5,7-9H,6,10H2,1H3
charge 0 multiplicity 1
27 atoms
O  -4.687177 -1.109821 0.414663
C  0.424112 -0.366918 0.730351
C  -0.491054 -0.186819 -0.527355
C  1.891435 -0.140478 0.398298
C  2.698403 -1.203721 -0.08389
C  2.47413 1.147301 0.52175
C  -1.937615 -0.470307 -0.221534
C  4.049667 -0.987254 -0.435673
C  3.825261 1.369369 0.171199
C  4.617956 0.302005 -0.31072
C  -2.97196 0.406122 -0.374636
C  -4.379562 0.03451 -0.035543
C  -5.435525 1.111338 -0.261971
H  0.089437 0.3409 1.511422
H  0.273293 -1.387599 1.132062
H  -0.133896 -0.891844 -1.306541
H  -0.364677 0.833955 -0.933501
H  -2.186817 -1.469519 0.171415
H  2.266915 -2.208782 -0.176199
H  1.866821 1.978715 0.901731
H  4.659456 -1.821371 -0.801252
H  4.259921 2.369841 0.278091
H  5.666441 0.471308 -0.580371
H  -2.794524 1.420425 -0.758626
H  -5.449388 1.420156 -1.325005
H  -5.200752 2.01473 0.333128
H  -6.429702 0.734259 0.022009
