program: Gaussian 09
title: 000119584
version: EM64L-G09RevD.01
frameworkgroup: C1[X(C21H25ClFN3O3)]
method: RPBEPBE
basis: SDD
operation: Freq
keyword: #p
keyword: freq=noraman
keyword: PBEPBE/SDD
title: #p freq=noraman PBEPBE/SDD
converged: YES YES NO NO
title: Mulliken charges:
elementType: Cl F O O O N N N C C C C C C C C C C C C C C C C C C C C C H H H H H H H H H H H H H H H H H H H H H H H H H
charge: -0.072830 -0.212986 -0.265692 -0.308602 -0.340464 -0.110533 -0.394345 -0.683744 0.017215 -0.376269 -0.342796 -0.316134 -0.482513 -0.504745 0.472443 -0.338513 -0.412518 0.170141 0.091354 -0.368381 -0.359009 0.310783 0.324274 -0.357940 -0.548281 -0.382546 0.682193 -0.229400 -0.693749 0.192470 0.224618 0.240175 0.204117 0.194030 0.211686 0.186766 0.259644 0.233392 0.217428 0.207040 0.360883 0.266638 0.240858 0.249040 0.253127 0.302177 0.238857 0.216439 0.214747 0.310516 0.324258 0.232211 0.219663 0.232809
chargesum: 0.00000
title: Mulliken charges with hydrogens summed into heavy atoms:
elementType: Cl F O O O N N N C C C C C C C C C C C C C C C C C C C C C
charge: -0.072830 -0.212986 -0.265692 -0.308602 -0.340464 -0.110533 -0.033463 -0.048970 0.209685 0.088523 0.055352 0.082318 0.010522 -0.080277 0.472443 -0.071874 -0.171660 0.170141 0.091354 -0.119341 -0.105882 0.310783 0.324274 -0.055763 -0.309424 -0.382546 0.682193 0.201786 -0.009066
polarizability: 3.03454974e+02 8.20072631e+01 2.45340157e+02 1.17420905e+01 -2.05582590e+01 2.63327396e+02
1716.lowfreq: -5.0845 -0.0002 0.0008 0.0015 2.3386 6.0364 9.6755 11.8585 23.2530
frequency: 8.7914 11.0857 22.8475 27.5425 35.7565 46.3164 55.6030 68.7627 89.0420 100.2097 111.2634 123.6615 130.0021 152.9246 156.7872 168.6830 194.8346 205.8123 245.2811 246.4706 256.5570 262.4278 278.8208 290.0666 303.9120 305.4532 329.2762 341.1334 347.7874 368.6815 377.8570 388.9123 399.5920 414.5811 423.7572 445.7752 452.5644 463.9196 469.3233 491.5260 492.6342 507.5974 536.5477 588.1615 597.9135 612.0685 629.8254 637.1613 662.2842 698.6837 704.3976 706.6504 727.1425 742.3493 745.2556 778.6097 798.4294 817.2935 822.5764 823.3997 832.5990 840.7968 845.6249 873.0897 880.1472 903.4536 938.3379 941.3920 958.7233 969.1997 993.8838 1000.1250 1006.2410 1014.0766 1027.4818 1039.0329 1052.3638 1056.1685 1079.9423 1097.0216 1110.2252 1114.7318 1115.5907 1131.5206 1137.8825 1138.5557 1148.9028 1152.8825 1175.2611 1186.0718 1198.3292 1212.5681 1226.0908 1235.6037 1244.4655 1255.3324 1265.0876 1269.7148 1285.7983 1291.7214 1310.4758 1313.9797 1318.1654 1332.1801 1356.3013 1361.3672 1364.5100 1371.2355 1380.3844 1389.8131 1394.6868 1401.7624 1409.7505 1428.9397 1446.1775 1448.2912 1453.3353 1456.0457 1464.4760 1470.4460 1479.7297 1489.9890 1493.1379 1504.9731 1525.4181 1551.2958 1591.2128 1604.5278 1612.1931 1617.8656 1641.8839 2861.0262 2872.5699 2902.9301 2928.3764 2953.9184 2967.4942 2986.6373 2996.6204 3015.0092 3019.9370 3028.5190 3055.0110 3078.1053 3088.4758 3094.3211 3104.3317 3131.9452 3146.5118 3158.3905 3160.3963 3170.5618 3174.8668 3458.5285 3548.4193 3697.2825
redmass: 9.0831 5.9488 4.3739 5.4452 5.1159 4.8477 4.8662 7.6720 5.4494 3.6680 1.7798 6.7735 3.9611 4.1402 5.5297 4.6786 5.2969 6.2083 1.2932 3.2107 3.6659 4.7120 3.5439 4.9798 3.9922 3.2497 4.0875 3.8330 3.4904 5.4393 2.3372 4.4561 1.3989 2.9705 4.0118 2.5903 5.0600 2.4678 4.1129 3.2406 1.2228 3.7738 4.5211 6.1567 2.5379 4.8271 6.4373 8.0651 5.4287 2.8968 3.4152 1.1134 5.9093 4.5330 4.2369 2.8989 3.1186 1.9032 1.5727 1.6972 2.4460 2.5855 1.4042 2.8115 2.9519 1.9009 1.4103 1.3633 2.2174 1.3906 2.0269 2.7233 2.7037 2.4351 4.5071 2.9147 1.9266 2.2371 2.7464 1.4237 2.7625 2.1719 2.1529 3.6800 1.4392 2.6299 2.3031 1.5544 2.0910 1.8107 1.1252 3.7736 1.3340 1.2862 1.7754 1.5936 1.1391 1.3740 1.4579 1.2958 1.3309 1.3970 2.6336 1.4613 1.3422 1.4652 1.5799 1.3368 2.1498 2.7882 3.1667 1.3996 2.1977 5.2707 1.0883 1.0958 1.1257 1.0991 1.0398 1.1207 1.0750 1.1321 2.5568 2.8865 2.1899 6.5351 5.4282 7.6796 6.4707 1.8034 2.3552 1.0697 1.0696 1.0698 1.0822 1.0665 1.0554 1.0877 1.0362 1.0607 1.0899 1.1079 1.0910 1.0970 1.1024 1.0988 1.1018 1.0900 1.0885 1.0905 1.0909 1.0961 1.0958 1.0800 1.0458 1.1032
irintensity: 0.1283 2.2379 1.0363 0.8390 1.1227 0.9565 0.7245 7.8113 0.2169 0.1941 0.6059 0.5967 0.6573 1.0860 1.0807 1.2044 2.4888 2.4930 0.9470 0.5327 5.4023 0.9807 2.7864 7.3906 3.8248 0.3483 2.7774 4.3403 46.1290 3.8872 1.5197 2.6604 76.6355 0.4541 30.3234 49.3838 0.4350 3.5168 2.0692 22.5156 124.3493 17.0792 9.0702 6.8737 2.8087 0.2420 1.2853 16.6403 42.6750 2.1514 1.2527 101.5901 4.2408 17.4667 8.1691 17.6497 9.4117 23.9392 45.8969 11.0041 25.7078 53.8277 11.8969 7.7819 27.3859 0.7578 3.8856 13.6171 19.2987 3.3666 2.9767 1.9648 16.3687 20.5450 6.6253 71.6530 27.3064 56.7153 40.0648 13.2139 14.0377 43.9068 8.6570 155.3092 3.9179 20.0158 18.7152 15.7782 51.5974 20.0902 5.5633 19.1506 5.7476 51.4236 234.2007 1.2664 0.1054 32.7677 2.2930 14.4987 21.1455 22.5170 93.2167 31.2071 7.7156 21.6291 0.7424 2.1183 1.5715 33.7160 5.8827 11.8634 6.7367 29.8175 2.3519 5.8299 29.3201 12.4369 13.5605 18.0598 23.7644 1.8672 75.0224 261.3666 185.1351 18.4044 228.0726 6.9429 12.9067 27.4682 433.4795 31.0561 138.2272 27.6279 57.7496 79.6186 36.4077 24.2796 16.9678 38.3123 59.9654 26.1459 21.9527 49.3713 9.0174 26.8165 32.5974 9.1659 2.1458 1.5675 19.6779 6.2227 3.5901 135.9129 118.0533 35.0277
temp: 298.150 k
press: 1.00000 atm
elementType: 17 9 8 8 8 7 7 7 6 6 6 6 6 6 6 6 6 6 6 6 6 6 6 6 6 6 6 6 6 1 1 1 1 1 1 1 1 1 1 1 1 1 1 1 1 1 1 1 1 1 1 1 1 1
symmnumber: 1
zpe: 1130909.8 jmol-1
zpe.correction: 0.430741 hartree
zpe.thermalcorrener: 0.458976 hartree
zpe.thermalcorrenthalpy: 0.459920 hartree
zpe.thermalcorrgfe: 0.367945 hartree
zpe.sumelectzpe: -1762.906822 hartree
zpe.sumelectthermal: -1762.878587 hartree
zpe.sumelectthermalent: -1762.877643 hartree
zpe.sumelectthermalfe: -1762.969618 hartree
dipole: 1.9514 -0.9040 6.0351
dipole: 6.4068
quadrupole: -140.4216 -190.8482 -170.9765
quadrupole: 0.4542 21.8598 -20.8635
quadrupole: 26.9938 -23.4328 -3.5611 0.4542 21.8598 -20.8635
hfenergy: -1763.3375624 hartree
pointgroup: C01 [X(C21H25Cl1F1N3O3)]
dipole: 0.5810866 -0.7284969 -2.3420534 debye
polarizability: 316.82481|-73.8587126|224.0165941|23.3382231|4.1859653|271.2811231 unknown
InChI: InChI=1S/C21H25ClFN3O3/c1-2-28-20-10-19(24)18(22)9-17(20)21(27)25-11-16-13-26(7-8-29-16)12-14-3-5-15(23)6-4-14/h3-6,9-10,16,25H,2,7-8,11-13,24H2,1H3
charge 0 multiplicity 1
54 atoms
Cl 5.198283 0.127704 2.402863
F  -0.4735 -5.374388 0.501024
O  -3.755671 2.797918 -0.443471
O  0.475484 2.283082 1.417587
O  1.68918 0.943613 -2.450513
N  -3.775991 0.189386 0.803178
N  -0.100348 2.142265 -0.832446
N  5.843183 -0.744428 -0.440854
C  -2.584072 1.898695 -0.535506
C  -2.513943 0.967567 0.68669
C  -4.937181 1.101539 0.933385
C  -4.997737 2.022317 -0.296046
C  -1.372772 2.847698 -0.652367
C  -3.713305 -0.833644 1.872758
C  -2.818805 -2.014149 1.504559
C  -2.861826 -2.558493 0.195426
C  -1.968358 -2.610941 2.466816
C  0.761038 1.916729 0.227156
C  2.062199 1.215949 -0.069339
C  -2.082168 -3.682651 -0.150764
C  -1.178638 -3.738951 2.144489
C  -1.258938 -4.248754 0.838884
C  2.529249 0.739269 -1.334739
C  2.909233 1.009142 1.050056
C  3.777114 0.092471 -1.460264
C  4.14023 0.371286 0.924151
C  4.617683 -0.10964 -0.328616
C  2.122225 0.462041 -3.778512
C  1.016809 0.821027 -4.768141
H  -2.685255 1.273948 -1.453214
H  -2.315737 1.57795 1.600261
H  -1.669446 0.267106 0.564422
H  -5.86637 0.502096 0.989526
H  -4.872996 1.730863 1.856598
H  -5.801186 2.771477 -0.197536
H  -5.166382 1.40852 -1.207434
H  -1.305828 3.454542 0.266576
H  -1.547366 3.524668 -1.508376
H  -4.747669 -1.200815 2.033007
H  -3.373635 -0.403641 2.848186
H  0.199629 1.82408 -1.760559
H  -3.502814 -2.073091 -0.547904
H  -1.911942 -2.18885 3.477098
H  -2.106076 -4.115319 -1.155503
H  -0.512872 -4.205262 2.876414
H  2.544305 1.376597 2.014641
H  4.126102 -0.270339 -2.431126
H  2.280074 -0.634094 -3.731919
H  3.078471 0.95413 -4.04708
H  6.17448 -1.093651 -1.334673
H  6.418152 -0.876408 0.388644
H  0.066143 0.3347 -4.489612
H  1.295947 0.479112 -5.781069
H  0.858813 1.912622 -4.803513
