program: Gaussian 09
title: 000118391
version: EM64L-G09RevD.01
frameworkgroup: C1[X(C10H13NO5S)]
method: RPBEPBE
basis: SDD
operation: Freq
keyword: #p
keyword: freq=noraman
keyword: PBEPBE/SDD
title: #p freq=noraman PBEPBE/SDD
converged: YES YES NO NO
title: Mulliken charges:
elementType: S O O O O O N C C C C C C C C C C H H H H H H H H H H H H H
charge: 0.942331 -0.256699 -0.280353 -0.539103 -0.540461 -0.258326 -0.717008 -0.064512 0.142260 -0.307125 0.215718 -0.213872 -0.328637 0.193196 -0.217881 -0.668660 -0.525764 0.317220 0.286167 0.270267 0.333578 0.336059 0.232587 0.227513 0.213502 0.234302 0.233083 0.218327 0.236718 0.285575
chargesum: 0.00000
title: Mulliken charges with hydrogens summed into heavy atoms:
elementType: S O O O O O N C C C C C C C C C C
charge: 0.942331 -0.256699 -0.280353 -0.539103 -0.540461 -0.258326 -0.047372 -0.064512 0.142260 0.010094 0.215718 0.072295 -0.058370 0.193196 0.242219 0.012227 0.214856
polarizability: 2.13769073e+02 -3.51853823e+00 1.82158625e+02 -1.11974939e+00 1.49233988e+00 9.97554290e+01
1716.lowfreq: -31.9925 0.0003 0.0009 0.0010 0.5129 3.6198 6.5648 37.0444 54.8297
frequency: -31.7171 36.9165 54.8140 71.1054 74.8555 81.7003 101.3998 118.1747 135.7187 160.9041 185.7086 197.7059 210.9844 240.7744 250.8664 257.0386 268.8420 285.8115 311.3796 338.4125 371.1441 383.0009 413.3405 420.8763 463.8508 473.8820 510.5767 564.5539 610.5231 657.0710 704.3158 745.8768 766.6001 793.6078 798.3325 800.1164 816.8140 846.0985 859.7444 907.3246 944.6650 963.9681 977.9607 1015.3378 1043.8362 1067.3469 1076.6775 1112.8247 1114.3699 1130.2675 1135.8406 1153.3568 1220.4560 1233.2206 1248.5008 1251.2832 1355.2542 1379.5645 1395.6599 1404.4203 1429.5953 1452.3802 1464.6383 1465.4445 1473.2024 1473.9877 1486.8752 1532.5272 1560.6912 1599.6914 1612.5014 2988.1443 2998.3877 3010.4510 3069.7011 3095.0014 3103.4341 3110.5733 3136.4847 3160.2439 3174.6364 3182.1472 3365.6177 3533.4284
redmass: 3.3560 3.6749 4.0307 3.5302 1.8636 4.7465 2.5655 4.0545 4.8580 3.4393 1.5216 4.6572 4.6540 4.0406 1.9355 2.3637 2.7007 3.9964 5.2479 5.4498 5.9041 4.1958 9.3003 5.1450 4.2244 4.2394 4.8509 3.8253 6.3944 6.8057 7.0342 6.1563 4.0325 2.1008 4.6985 1.1731 3.5173 1.5278 5.2806 3.9896 1.4447 7.8257 1.3659 2.3973 5.7277 1.6838 1.9939 2.0703 1.3076 1.4358 1.4612 1.2877 3.6980 3.2562 1.1421 1.4068 1.4322 3.3386 6.0474 1.2997 1.5336 1.0972 1.0497 1.7976 1.0751 1.0626 1.0709 1.0854 7.0825 8.6676 8.7968 1.0328 1.0361 1.0581 1.1068 1.0985 1.0993 1.1024 1.1059 1.0891 1.0917 1.0970 1.0414 1.1001
irintensity: 3.5617 1.2186 1.7231 7.2317 20.9834 3.2855 9.2681 5.0496 3.6594 5.9221 0.7882 5.0872 3.6274 0.4110 1.2273 6.3331 3.2280 1.0332 4.5607 14.7717 2.1294 8.8086 80.3288 20.8586 33.9045 122.6715 18.6003 47.5160 13.9651 10.6694 4.2764 3.8718 5.0320 40.0996 73.7203 10.9044 98.9208 39.2492 39.9008 51.3281 8.6125 34.3471 2.0946 6.4723 296.7962 43.8998 25.4346 3.9052 4.3723 52.0366 7.6190 8.8254 365.4256 118.7458 0.9890 63.3814 2.3445 36.2914 13.1515 20.4442 7.1541 43.5895 7.1699 108.4730 33.0842 5.0532 10.2818 22.1739 32.0828 32.3477 246.5833 48.8348 17.8061 19.9250 8.9351 28.5020 30.1604 38.1791 10.7238 1.7785 6.9549 3.7172 27.3152 24.2857
temp: 298.150 k
press: 1.00000 atm
elementType: 16 8 8 8 8 8 7 6 6 6 6 6 6 6 6 6 6 1 1 1 1 1 1 1 1 1 1 1 1 1
symmnumber: 1
zpe: 580161.1 jmol-1
zpe.correction: 0.220972 hartree
zpe.thermalcorrener: 0.239117 hartree
zpe.thermalcorrenthalpy: 0.240061 hartree
zpe.thermalcorrgfe: 0.174339 hartree
zpe.sumelectzpe: -1216.312319 hartree
zpe.sumelectthermal: -1216.294173 hartree
zpe.sumelectthermalent: -1216.293229 hartree
zpe.sumelectthermalfe: -1216.358951 hartree
dipole: 3.3032 0.2410 1.3814
dipole: 3.5885
quadrupole: -104.0438 -98.1211 -111.8695
quadrupole: 5.7298 -20.6091 9.3572
quadrupole: 0.6343 6.5571 -7.1914 5.7298 -20.6091 9.3572
hfenergy: -1216.5332904 hartree
pointgroup: C01 [X(C10H13N1O5S1)]
dipole: -1.3323075 0.0310184 0.4661452 debye
polarizability: 212.4020475|-5.9822807|182.9017902|7.6859072|-3.7703377|100.3792894 unknown
InChI: InChI=1S/C10H13NO5S/c1-3-16-10(12)8-6-7(17(11,13)14)4-5-9(8)15-2/h4-6H,3,11H2,1-2H3
charge 0 multiplicity 1
30 atoms
S  3.218675 -0.939063 -0.036756
O  -1.357549 2.997465 -0.209025
O  -2.013458 -1.377087 -0.318733
O  2.70063 -2.369954 -0.618568
O  4.49918 -0.129119 -0.636874
O  -2.988582 0.478873 0.69002
N  3.583038 -1.195997 1.751694
C  1.760164 0.23564 -0.027101
C  -0.653578 0.567431 -0.064075
C  0.475919 -0.301773 -0.06415
C  -0.419691 1.983946 -0.096918
C  2.016041 1.621159 0.005901
C  0.914567 2.483653 -0.035831
C  -1.995364 -0.056295 0.13264
C  -3.269891 -2.145836 -0.05416
C  -3.056915 -3.541958 -0.628572
C  -2.653494 2.812846 -0.892733
H  0.319196 -1.383697 -0.086939
H  3.042254 2.000637 0.017994
H  1.043608 3.569166 -0.055612
H  3.42052 -2.192848 1.971588
H  4.557929 -0.895786 1.919518
H  -3.446058 -2.154122 1.036872
H  -4.109354 -1.611096 -0.534001
H  -3.960531 -4.15533 -0.459182
H  -2.864949 -3.497434 -1.71392
H  -2.20134 -4.043238 -0.145012
H  -2.547885 2.115714 -1.744909
H  -2.91542 3.818266 -1.255595
H  -3.405061 2.429739 -0.187063
