program: Gaussian 09
title: 000118400
version: EM64L-G09RevD.01
frameworkgroup: C1[X(C12H14O5)]
method: RPBEPBE
basis: SDD
operation: Freq
keyword: #pfreq=noraman
keyword: PBEPBE/SDD
title: #p freq=noraman PBEPBE/SDD
converged: YES YES NO NO
title: Mulliken charges:
elementType: O O O O O C C C C C C C C C C C C H H H H H H H H H H H H H H
charge: -0.282883 -0.297271 -0.273717 -0.440692 -0.261638 0.092854 0.397915 0.065966 0.257620 -0.403199 -0.374154 -0.252636 -0.317451 -0.491785 -0.521531 -0.533549 0.145298 0.233639 0.243478 0.300795 0.240513 0.233719 0.206017 0.255697 0.232939 0.204147 0.264342 0.224228 0.232323 0.246663 0.372356
chargesum: 0.00000
title: Mulliken charges with hydrogens summed into heavy atoms:
elementType: O O O O O C C C C C C C C C C C C
charge: -0.282883 -0.297271 -0.273717 -0.068336 -0.261638 0.092854 0.397915 0.065966 0.257620 -0.169561 -0.130676 0.048159 -0.076938 0.203648 0.179897 0.169664 0.145298
polarizability: 2.91517370e+02 3.31826611e+00 1.70561253e+02 2.86150697e-01 -2.20906716e+00 7.47103438e+01
1716.lowfreq: -4.5477 -3.1887 0.0007 0.0008 0.0010 4.3906 34.8622 43.0984 51.9171
frequency: 34.8457 43.0874 51.9095 70.3151 85.8401 106.4182 114.1837 145.1430 153.1192 176.1062 187.1274 208.4166 212.0136 230.0925 240.7240 254.4930 296.0526 310.3381 350.8965 371.4019 405.8305 452.2336 474.8607 502.9561 556.4144 579.4897 582.4304 616.3838 641.1792 662.8167 695.7679 745.8858 774.1402 792.6272 852.5229 879.4235 896.6942 928.5437 941.0101 973.2665 1005.6295 1030.9231 1052.9822 1072.4265 1107.1438 1108.8019 1110.6133 1146.9540 1149.9750 1155.1753 1188.5450 1205.5473 1227.4203 1255.8734 1280.7290 1292.7756 1337.4567 1377.5919 1399.5076 1425.4923 1437.9933 1446.2381 1452.8812 1459.6200 1467.3951 1468.5834 1469.8499 1479.5256 1483.0534 1561.8253 1596.3457 1626.4467 1641.8298 2967.0173 2969.5100 2983.8627 3062.6473 3080.1864 3095.9347 3125.8608 3129.6603 3131.2798 3140.8174 3149.4995 3161.2239 3174.3995 3525.2550
redmass: 6.3565 4.0940 3.8464 5.3930 3.6824 1.6602 3.6684 3.3956 1.6057 3.4485 2.2334 2.1935 1.5694 4.1530 1.5857 4.5430 3.3818 5.4697 4.3137 3.7512 4.5250 6.0389 5.8098 5.0877 2.2794 4.4445 2.1117 3.0385 5.7382 4.3201 4.4583 6.4332 7.2217 1.5010 7.1074 1.9028 7.0778 1.3794 5.0578 8.9442 5.3090 1.1929 2.3208 3.4728 1.2386 1.2402 1.2562 1.4325 1.3745 1.4212 2.3242 1.8519 1.3721 2.1213 2.9981 1.7567 2.4099 6.0751 1.9888 1.2434 1.2033 1.4123 1.0824 1.1936 1.0530 1.3784 1.0741 1.7049 1.0613 6.4712 6.9665 7.4439 6.1556 1.0361 1.0326 1.0338 1.1044 1.0951 1.0979 1.1046 1.1004 1.1058 1.0914 1.0875 1.0893 1.0955 1.0640
irintensity: 1.1294 1.6714 4.3145 0.5088 1.4971 2.3791 10.9784 3.0429 0.6986 5.7156 0.5170 0.2505 2.0745 1.4532 0.2733 0.6304 4.4038 4.1331 5.1652 0.5905 10.6363 5.9305 12.9526 75.4839 33.4409 13.1126 54.4843 51.5488 3.7361 29.2595 19.4910 14.7666 2.6516 48.7229 2.4898 19.7224 67.2723 0.0580 10.4800 9.4902 22.1330 36.4046 670.1101 269.1246 3.7019 7.4278 0.0647 11.6490 5.6410 35.6428 39.0880 35.4975 7.1318 75.4940 389.7978 2.7909 18.3828 67.0948 74.4855 12.0138 12.3579 57.9779 34.5731 24.2750 20.3151 142.8305 12.1519 23.7985 13.4733 24.2615 461.3017 368.7153 125.8881 84.2177 71.3790 75.9658 39.0985 38.4493 38.8165 13.7052 21.0788 16.3856 2.3237 5.0537 5.7079 12.7110 51.6119
temp: 298.150 k
press: 1.00000 atm
elementType: 8 8 8 8 8 6 6 6 6 6 6 6 6 6 6 6 6 1 1 1 1 1 1 1 1 1 1 1 1 1 1
symmnumber: 1
zpe: 626946.7 jmol-1
zpe.correction: 0.238791 hartree
zpe.thermalcorrener: 0.256851 hartree
zpe.thermalcorrenthalpy: 0.257795 hartree
zpe.thermalcorrgfe: 0.191836 hartree
zpe.sumelectzpe: -840.462916 hartree
zpe.sumelectthermal: -840.444856 hartree
zpe.sumelectthermalent: -840.443912 hartree
zpe.sumelectthermalfe: -840.509871 hartree
dipole: -5.7883 -2.1953 1.9958
dipole: 6.5044
quadrupole: -92.7380 -83.9497 -102.9901
quadrupole: -1.2637 -4.1470 3.4364
quadrupole: 0.4879 9.2762 -9.7642 -1.2637 -4.1470 3.4364
hfenergy: -840.701707 hartree
pointgroup: C01 [X(C12H14O5)]
dipole: -2.2672582 -0.8865042 0.7887873 debye
polarizability: 291.4913457|3.0026888|170.5748657|-3.0776357|1.3497377|74.722756 unknown
InChI: InChI=1S/C12H14O5/c1-15-9-6-4-8(5-7-10(13)14)11(16-2)12(9)17-3/h4-7,13H,1-3H3
charge 0 multiplicity 1
31 atoms
O  0.107053 2.044105 -0.183695
O  -2.723051 1.444788 -0.272334
O  -3.549509 -1.186486 -0.010756
O  5.408432 -1.287446 0.030802
O  4.835602 0.970477 0.025328
C  -0.394676 0.751485 -0.053688
C  0.606197 -0.283283 0.010467
C  -1.779416 0.422761 -0.050815
C  -2.169805 -0.948663 0.030814
C  0.168265 -1.630185 0.09385
C  -1.192807 -1.971107 0.113864
C  2.018989 0.091491 0.003698
C  3.094544 -0.760694 0.020502
C  -0.641087 3.225865 0.283743
C  -3.760777 1.63883 0.764063
C  -4.000528 -2.58268 -0.050087
C  4.464461 -0.232605 0.025043
H  0.913187 -2.429479 0.154258
H  -1.487776 -3.021441 0.180537
H  2.233214 1.166741 -0.018494
H  3.002552 -1.850861 0.02606
H  0.113081 4.027872 0.309495
H  -1.046989 3.060295 1.299513
H  -1.458205 3.473312 -0.40989
H  -4.365003 2.487116 0.407758
H  -3.294699 1.888888 1.737997
H  -4.38515 0.736434 0.862254
H  -3.722038 -3.121295 0.875645
H  -3.586123 -3.108405 -0.930604
H  -5.095631 -2.524724 -0.131643
H  6.31969 -0.887908 0.032215
