program: Gaussian 09
title: 000118603
version: EM64L-G09RevD.01
frameworkgroup: C1[X(C21H18N4O8S2)]
method: RPBEPBE
basis: SDD
operation: Freq
keyword: #p
keyword: freq=noraman
keyword: PBEPBE/SDD
title: #p freq=noraman PBEPBE/SDD
converged: YES YES NO NO
title: Mulliken charges:
elementType: S S O O O O O O O O N N N N C C C C C C C C C C C C C C C C C C C C C H H H H H H H H H H H H H H H H H H
charge: 0.994051 0.991040 -0.208630 -0.225155 -0.568233 -0.499336 -0.500999 -0.569340 -0.503767 -0.504605 -0.273184 -0.011553 -0.317367 -0.026664 -0.443279 0.174553 0.160513 -0.131893 0.055706 0.444745 0.096947 0.131885 -0.755480 0.451166 -0.322215 -0.361146 -0.777064 -0.081156 -0.222454 -0.204514 -0.327225 -0.367375 -0.083234 -0.224031 -0.207125 0.292541 0.271637 0.261949 0.244558 0.254914 0.309944 0.295670 0.225262 0.287980 0.265182 0.285035 0.285491 0.310553 0.294629 0.281915 0.283608 0.384034 0.381520
chargesum: 0.00000
title: Mulliken charges with hydrogens summed into heavy atoms:
elementType: S S O O O O O O O O N N N N C C C C C C C C C C C C C C C C C C C C C
charge: 0.994051 0.991040 -0.208630 -0.225155 -0.184199 -0.499336 -0.500999 -0.187820 -0.503767 -0.504605 -0.273184 -0.011553 -0.317367 -0.026664 -0.150738 0.174553 0.160513 0.139743 0.055706 0.444745 0.096947 0.131885 0.005941 0.451166 -0.012271 -0.065476 0.001359 -0.081156 0.062581 0.080976 -0.016672 -0.072747 -0.083234 0.057883 0.076483
polarizability: 6.42677009e+02 1.05961988e+01 2.75283278e+02 -1.03804964e+01 -2.12969616e+01 2.65702790e+02
1716.lowfreq: -1.8292 -0.0007 0.0009 0.0014 1.3666 5.5569 8.8528 15.4983 19.7908
frequency: 8.7190 15.2949 19.6843 28.3730 33.0792 42.8748 48.7237 57.4577 61.4556 71.6706 79.8739 92.2893 112.8392 116.6587 121.9521 133.2132 153.7692 156.3088 160.9708 173.1917 177.0302 180.3518 184.5614 191.4985 207.9985 227.5084 245.1509 272.1268 272.8990 281.4913 291.2396 294.9438 303.5007 316.3186 324.8937 325.9998 332.8049 347.4227 361.8252 370.1955 382.3145 392.0394 396.7597 405.7224 412.7900 416.6173 418.7442 465.7244 469.1153 521.6923 522.9581 546.4403 552.6698 561.1206 561.9788 577.9955 600.3325 617.1067 617.6451 631.9369 658.3604 681.2838 687.5804 701.4518 737.2582 737.3498 745.8695 770.8092 785.6118 819.1895 833.7351 834.5009 851.7163 851.8048 863.2863 863.8997 892.4624 898.0309 950.5850 965.7117 967.6411 983.6264 984.8917 987.7418 988.2664 992.4812 999.5842 999.8189 1000.7501 1009.8048 1034.3052 1040.1997 1044.6890 1044.8705 1047.7276 1051.4085 1059.4134 1061.3402 1104.9473 1123.0318 1125.5852 1128.2259 1155.4336 1167.0813 1185.3770 1187.9781 1221.6505 1270.4020 1294.6355 1299.2763 1299.7286 1340.9828 1358.0258 1385.6487 1389.4477 1395.0430 1406.0064 1411.4485 1414.1975 1419.0916 1451.3668 1456.3328 1460.9500 1472.7280 1477.4370 1482.8553 1532.0415 1578.3468 1588.5834 1593.8397 1595.1119 1596.3750 1617.4733 1636.2894 1679.6212 2976.7691 2982.4129 3015.4627 3056.8700 3059.9389 3092.5515 3109.1041 3116.2407 3163.7652 3163.9207 3164.0542 3164.8884 3192.2188 3194.8549 3198.2559 3200.6919 3480.5272 3482.3952
redmass: 10.3842 8.3119 8.4427 7.7791 8.2966 6.2048 5.3313 4.3641 4.3230 8.2120 7.5499 8.5171 5.8504 6.7446 5.5551 6.4068 1.2912 4.4254 3.3395 1.9258 2.9881 2.1761 3.8883 6.2063 5.9325 1.0765 6.0716 3.2551 3.3587 4.5778 5.1389 6.1705 4.8620 6.2810 9.9251 9.6614 5.6857 7.6256 6.1397 6.7866 6.1407 5.8432 5.9836 6.5734 4.8957 3.2108 3.2584 8.3086 7.3628 4.1538 4.3882 6.2234 6.2886 6.5410 6.4307 4.5989 5.0056 7.1395 7.1246 7.6573 6.7112 6.5442 6.6973 6.9165 3.8152 3.8084 5.0145 7.2374 6.5010 5.2599 12.3223 12.7984 1.2483 1.2436 1.5245 1.5232 3.4364 3.8329 2.0776 17.2480 16.5934 2.8998 3.9429 1.4037 1.4814 2.8453 1.3846 1.8540 1.4620 3.0903 4.4305 1.9625 3.0598 1.4770 1.3011 1.5318 2.0459 2.0126 3.9856 3.3264 1.2923 1.3945 2.9153 1.3998 1.1551 1.1600 1.6444 2.0608 4.3278 1.2805 1.2813 3.0402 3.7856 4.0445 9.6721 1.9641 1.3846 2.2378 3.2060 2.8829 1.1171 1.0472 1.2393 1.1083 2.5477 2.6068 3.7549 6.4290 7.8666 7.0496 6.5071 5.9585 11.6070 11.7344 9.7414 1.0394 1.0385 1.0812 1.0968 1.0965 1.0895 1.0980 1.0985 1.0911 1.0915 1.0913 1.0915 1.0956 1.0953 1.0949 1.0947 1.0661 1.0661
irintensity: 0.3856 0.4247 0.3055 0.6896 1.1540 0.4885 0.7656 1.0061 0.8279 1.5437 1.1099 0.4390 0.4585 0.1995 0.1969 0.2892 3.0853 5.7581 33.4967 32.9421 15.1255 26.7628 7.7380 2.6805 3.6938 0.1942 2.5404 74.2453 24.5212 26.6114 22.2509 12.0835 1.9928 9.5190 39.4743 14.9300 9.5506 13.2160 25.7189 106.6964 9.6495 6.4268 4.7352 3.8890 3.0930 0.4113 0.2909 34.9649 8.4916 73.2989 18.8062 59.6114 49.5142 113.8534 161.0652 80.0927 10.9402 0.0957 1.5313 2.0436 4.6174 46.7337 52.2898 11.6063 0.3126 1.1184 3.2878 97.7450 6.7767 20.1710 72.4147 114.6494 1.2745 0.9897 69.9392 79.6634 57.1295 2.9941 10.4495 85.4227 86.8772 20.7366 0.2808 11.6130 1.9857 10.2795 1.3028 16.8909 5.0657 37.9273 35.8176 9.7129 8.2091 77.0422 53.7809 3.5557 123.4499 105.1166 17.0133 240.2584 13.6552 41.9767 20.7294 12.7243 15.4503 14.3797 4.9949 13.6571 435.7528 11.8260 4.8055 141.4710 200.5253 6.4907 0.6872 8.4525 30.6048 9.5988 24.5204 37.4382 24.7763 18.3701 17.6496 15.6433 311.9689 204.9807 18.1708 16.2926 8.7866 185.0331 168.4185 88.8472 167.2944 54.0014 214.3868 16.4877 9.2571 4.7121 8.0527 6.7833 0.5667 5.7956 8.7479 0.3762 2.0667 6.0586 4.8654 6.3601 4.4629 0.1116 0.2257 43.9997 47.9031
temp: 298.150 k
press: 1.00000 atm
elementType: 16 16 8 8 8 8 8 8 8 8 7 7 7 7 6 6 6 6 6 6 6 6 6 6 6 6 6 6 6 6 6 6 6 6 6 1 1 1 1 1 1 1 1 1 1 1 1 1 1 1 1 1 1
symmnumber: 1
zpe: 955914.6 jmol-1
zpe.correction: 0.364089 hartree
zpe.thermalcorrener: 0.398637 hartree
zpe.thermalcorrenthalpy: 0.399581 hartree
zpe.thermalcorrgfe: 0.293582 hartree
zpe.sumelectzpe: -2425.055918 hartree
zpe.sumelectthermal: -2425.021370 hartree
zpe.sumelectthermalent: -2425.020425 hartree
zpe.sumelectthermalfe: -2425.126425 hartree
dipole: 3.2771 9.4173 3.2791
dipole: 10.4965
quadrupole: -309.9055 -219.7099 -221.3766
quadrupole: -0.5430 8.2852 -5.2173
quadrupole: -59.5748 30.6208 28.9541 -0.5430 8.2852 -5.2173
hfenergy: -2425.4200068 hartree
pointgroup: C01 [X(C21H18N4O8S2)]
dipole: -1.3331537 3.6374359 -1.4303012 debye
polarizability: 642.9053381|-6.4955626|276.6656109|-9.9722896|20.7451145|264.0921288 unknown
InChI: InChI=1S/C21H18N4O8S2/c1-12-18(20(26)24(22-12)14-3-7-16(8-4-14)34(28,29)30)11-19-13(2)23-25(21(19)27)15-5-9-17(10-6-15)35(31,32)33/h3-11,18,28,31H,1-2H3
charge 0 multiplicity 1
53 atoms
S  -8.653655 -2.051939 0.438791
S  9.033019 -1.380259 0.491522
O  -1.988181 -0.359683 -1.264519
O  2.439367 0.872918 1.826764
O  -9.394333 -1.443882 -1.154846
O  -8.370988 -3.639063 0.301199
O  -9.533412 -1.471812 1.666486
O  9.793636 0.317509 0.413564
O  9.231844 -1.954645 1.991662
O  9.545005 -2.22726 -0.788968
N  -3.467225 1.054916 -0.021545
N  -3.425321 2.366169 0.572998
N  3.309203 0.40496 -0.367101
N  2.814859 0.450967 -1.713772
C  -1.313902 1.92719 -0.420677
C  -2.223411 2.866151 0.36059
C  -2.255226 0.697003 -0.642792
C  -0.03577 1.56305 0.28966
C  1.127638 1.134789 -0.281612
C  -4.680649 0.312927 0.072618
C  1.552819 0.880004 -1.670365
C  2.327182 0.803843 0.572272
C  -1.839966 4.225898 0.854697
C  4.649248 -0.011703 -0.1512
C  -4.768913 -0.996085 -0.475762
C  -5.792231 0.903926 0.731732
C  0.75666 1.007577 -2.936096
C  -7.059453 -1.096167 0.280668
C  -5.979066 -1.708995 -0.372003
C  -7.000921 0.192267 0.835658
C  5.175995 -0.080025 1.169029
C  5.450249 -0.361901 -1.272205
C  7.275419 -0.820284 0.234131
C  6.509883 -0.486518 1.362424
C  6.782552 -0.768546 -1.080086
H  -1.092943 2.341844 -1.422663
H  -0.044904 1.60692 1.389717
H  -2.67479 4.683269 1.408314
H  -1.564589 4.889615 0.013383
H  -0.958262 4.171926 1.520512
H  -3.907613 -1.441824 -0.976285
H  -5.696331 1.906936 1.150136
H  0.487268 2.061251 -3.143284
H  -0.173755 0.414889 -2.871589
H  1.354291 0.63997 -3.785429
H  -6.071928 -2.721771 -0.775651
H  -7.868027 0.620198 1.347676
H  4.548347 0.184756 2.021989
H  5.020147 -0.30833 -2.273598
H  6.936528 -0.556336 2.367586
H  7.416539 -1.052657 -1.925415
H  -10.295157 -1.871143 -1.250938
H  10.778826 0.210489 0.559123
