program: Gaussian 09
title: 000118387
version: EM64L-G09RevD.01
frameworkgroup: C1[X(C25H22NS)]
method: RPBEPBE
basis: SDD
operation: Freq
keyword: #p
keyword: freq=noraman
keyword: PBEPBE/SDD
title: #p freq=noraman PBEPBE/SDD
converged: YES YES NO NO
title: Mulliken charges:
elementType: S N C C C C C C C C C C C C C C C C C C C C C C C C C H H H H H H H H H H H H H H H H H H H H H H
charge: 0.347607 -0.131762 0.386837 0.390473 -0.347836 -0.347547 -0.207719 -0.208087 0.414626 -0.355309 -0.355512 0.314466 0.314463 -0.367776 -0.367573 -0.347899 -0.347876 -0.347773 -0.347797 -0.636890 -0.636891 -0.214769 -0.214745 -0.214690 -0.214693 -0.221303 -0.221300 0.253090 0.253239 0.225055 0.225188 0.260443 0.260445 0.251638 0.251635 0.251648 0.251648 0.242224 0.255923 0.255913 0.255920 0.255916 0.242222 0.248287 0.248289 0.248299 0.248297 0.250978 0.250978
chargesum: 1.00000
title: Mulliken charges with hydrogens summed into heavy atoms:
elementType: S N C C C C C C C C C C C C C C C C C C C C C C C C C
charge: 0.347607 -0.131762 0.386837 0.390473 -0.347836 -0.347547 0.045371 0.045152 0.414626 -0.130253 -0.130324 0.314466 0.314463 -0.107333 -0.107128 -0.096261 -0.096241 -0.096125 -0.096149 0.117169 0.117167 0.033518 0.033543 0.033609 0.033605 0.029675 0.029678
polarizability: 6.03905371e+02 -4.44426052e-02 3.68008735e+02 -4.95738485e-02 -1.11227897e-01 1.97946136e+02
1716.lowfreq: -56.5322 -50.8987 -21.7595 -3.5580 0.0000 0.0004 0.0015 2.1020 6.4249
frequency: -56.5313 -50.8409 -21.7561 33.7501 43.9996 44.8885 46.3106 71.9846 97.0242 98.9279 123.8652 129.5632 165.2874 197.3134 197.4221 199.3355 209.0168 260.8209 262.4071 272.2835 283.9195 304.9906 355.5189 392.4650 392.6725 413.9779 415.6144 420.9246 488.2385 489.6819 504.3602 528.2184 535.9516 569.3613 588.1758 588.5197 616.6417 620.3181 623.4273 630.5381 645.4006 662.5730 677.3392 702.5583 704.4451 734.5498 750.0090 771.3606 773.5989 792.4675 809.4369 836.2985 852.6749 853.3272 867.4540 902.2396 907.7851 928.4770 931.8901 932.7567 964.9454 965.8324 969.1283 980.8786 981.0447 982.0606 986.1472 986.5180 1006.7272 1007.7391 1010.2501 1027.6515 1030.9506 1053.2636 1082.8254 1082.9669 1091.5047 1117.0335 1150.0176 1166.6239 1180.8125 1180.8340 1191.0641 1191.5835 1207.7719 1224.7332 1235.8042 1241.7574 1288.2004 1307.9197 1312.1700 1312.6358 1329.0636 1354.5489 1371.0027 1371.3201 1376.4079 1408.9644 1417.4107 1428.9754 1429.5406 1435.6454 1460.1449 1469.6726 1470.4712 1475.0611 1477.2411 1485.9711 1494.9312 1503.1265 1520.4569 1534.0508 1549.9424 1581.4009 1581.9315 1596.5269 1604.3986 1607.1273 1643.4190 2978.9199 2983.5767 3058.7637 3061.3056 3126.2675 3136.0769 3137.6216 3137.6365 3139.6464 3139.6955 3151.3718 3151.4061 3156.7493 3157.9361 3162.1671 3162.2079 3168.5454 3171.3994 3176.5046 3176.5724 3182.4835 3186.4631
redmass: 4.0806 3.7562 2.9356 4.7816 5.1850 5.4490 6.7191 1.9562 4.4328 4.2671 4.8821 1.1949 1.2348 6.1149 4.3625 4.3008 5.1268 3.5595 3.8775 6.4612 4.8747 5.3838 4.2144 2.8271 2.8308 3.9106 2.8794 4.7395 3.9178 3.6207 2.5338 4.7458 4.1815 5.7287 5.8450 6.6923 6.4007 6.4192 6.6038 7.2951 2.5406 5.7046 5.7763 1.7807 1.7463 5.2004 3.5759 1.8764 1.9854 1.2987 6.6848 1.8582 1.2412 1.2415 5.8322 1.7350 1.4003 1.4127 1.4005 3.1966 6.6938 1.3786 1.3590 1.3837 1.3839 3.2464 6.2579 6.1747 1.5908 1.3316 2.1367 2.1764 2.0540 1.5945 1.6145 1.6131 1.2335 1.3541 1.7354 1.6445 1.0542 1.0542 1.1137 1.1135 3.9918 1.4916 2.4722 2.2368 1.7400 1.7442 1.3771 1.3767 1.5175 1.8216 6.6096 6.6338 2.1847 5.2267 2.5886 2.1871 2.1896 1.1465 1.2439 1.0383 2.1698 1.3299 2.2397 1.0436 2.9366 1.1878 5.9923 5.5830 3.1399 5.8116 5.8310 5.4895 6.0754 5.9719 6.6405 1.0365 1.0385 1.1006 1.1034 1.0985 1.0965 1.0864 1.0864 1.0888 1.0888 1.0925 1.0925 1.0888 1.0885 1.0968 1.0968 1.0861 1.0880 1.1019 1.1019 1.0944 1.0957
irintensity: 0.0005 0.0001 0.0000 0.7454 0.3246 0.0693 0.0093 0.0000 0.0002 0.4340 0.0175 3.0286 0.0000 0.2604 1.0329 0.6368 0.0168 0.0012 2.2860 0.2210 0.0158 0.9338 5.1344 0.0004 0.0055 0.2573 0.0000 2.5045 0.8442 0.3983 9.3741 5.8944 39.5183 0.0003 10.4898 0.7368 0.6562 0.0005 3.0050 1.4536 0.2311 26.1492 58.5881 23.5770 126.3974 0.2098 0.0477 9.8384 40.4121 0.0000 34.3687 75.6456 0.0004 0.1613 19.3014 24.4081 0.0042 0.0322 0.1739 11.0879 17.2515 0.1088 0.0000 0.0001 0.0031 3.4709 15.3951 11.7024 0.8429 0.0375 2.4976 9.6858 5.5264 20.1428 0.0012 15.8059 0.0001 0.6814 0.8520 10.9829 0.0000 0.0005 9.1248 19.1287 42.0477 143.4836 9.6418 17.6932 0.9300 414.1748 0.0305 2.0575 17.5809 4.7602 0.4159 0.0000 2.5807 15.2919 287.6222 0.0005 25.1410 10.7909 24.1097 0.0000 34.3227 4.0766 43.8726 35.1840 0.0023 137.1668 52.0065 63.9734 119.4994 0.0017 4.0271 1030.9348 6.0316 596.8704 55.6282 35.6273 102.3265 0.0001 35.6400 1.6683 27.4876 2.0709 1.0580 0.0047 1.0012 6.6260 2.2636 0.5981 0.0268 0.4606 29.7401 4.0221 3.7824 22.5555 10.6224 12.3717 5.2847
temp: 298.150 k
press: 1.00000 atm
elementType: 16 7 6 6 6 6 6 6 6 6 6 6 6 6 6 6 6 6 6 6 6 6 6 6 6 6 6 1 1 1 1 1 1 1 1 1 1 1 1 1 1 1 1 1 1 1 1 1 1
symmnumber: 1
zpe: 1032711.2 jmol-1
zpe.correction: 0.393339 hartree
zpe.thermalcorrener: 0.415015 hartree
zpe.thermalcorrenthalpy: 0.415959 hartree
zpe.thermalcorrgfe: 0.341846 hartree
zpe.sumelectzpe: -1416.582044 hartree
zpe.sumelectthermal: -1416.560368 hartree
zpe.sumelectthermalent: -1416.559423 hartree
zpe.sumelectthermalfe: -1416.633536 hartree
dipole: 7.6826 -0.0032 0.0003
dipole: 7.6826
quadrupole: -51.5810 -105.3291 -153.3713
quadrupole: -0.0047 -0.0135 -0.0302
quadrupole: 51.8462 -1.9020 -49.9442 -0.0047 -0.0135 -0.0302
hfenergy: -1416.9753824 hartree
pointgroup: C01 [X(C25H22N1S1)]
dipole: -3.0225691 0.0002024 -0.0001134 debye
polarizability: 603.9053589|-0.0687836|368.0087465|-0.0495205|0.1112517|197.9461357 unknown
InChI: InChI=1S/C25H22NS/c1-26(2)23-15-13-19(14-16-23)22-17-24(20-9-5-3-6-10-20)27-25(18-22)21-11-7-4-8-12-21/h3-18H,1-2H3
charge 1 multiplicity 1
49 atoms
S  2.757055 -0.000167 0.000051
N  -6.231068 0.000766 0.00012
C  -0.488425 -0.000846 0.000084
C  -1.945139 -0.000734 0.000095
C  1.622271 1.401001 0.00008
C  1.622877 -1.401827 -0.000073
C  0.247785 1.241705 0.000096
C  0.248323 -1.243133 -0.00001
C  -4.854811 0.000276 0.000139
C  -2.710656 1.217819 0.000436
C  -2.711522 -1.218795 -0.000257
C  2.297566 2.731081 -0.000023
C  2.298748 -2.731614 -0.000161
C  -4.101645 1.228875 0.000464
C  -4.102516 -1.228858 -0.000246
C  2.612884 3.369168 1.228967
C  2.615731 -3.368683 -1.229252
C  2.62095 3.364916 -1.229119
C  2.621012 -3.366197 1.228843
C  -6.983098 1.274467 0.0006
C  -6.984004 -1.272401 -0.000542
C  3.237617 4.635713 1.224223
C  3.240995 -4.634965 -1.224716
C  3.245586 4.631505 -1.224671
C  3.246214 -4.632507 1.224187
C  3.554155 5.268249 -0.000297
C  3.556432 -5.268241 -0.000295
H  -0.30807 2.182996 -0.000024
H  -0.306999 -2.1847 0.000026
H  -2.20978 2.189615 0.000709
H  -2.211463 -2.190979 -0.000583
H  -4.619326 2.190788 0.000691
H  -4.620883 -2.190402 -0.000541
H  2.370479 2.878521 2.178067
H  2.374165 -2.87747 -2.178273
H  2.384639 2.871057 -2.17809
H  2.383442 -2.873108 2.1779
H  -8.061054 1.060091 0.001031
H  -6.753804 1.876191 -0.89845
H  -6.753072 1.875909 0.899643
H  -6.754984 -1.874493 0.898329
H  -6.75456 -1.873806 -0.899763
H  -8.061807 -1.057258 -0.000722
H  3.478794 5.124847 2.173532
H  3.483432 -5.123323 -2.174104
H  3.49285 5.117421 -2.174065
H  3.492641 -5.118988 2.17351
H  4.041022 6.248931 -0.000396
H  4.043722 -6.248713 -0.00035
