program: Gaussian 09
title: 000118362
version: EM64L-G09RevD.01
frameworkgroup: C1[X(C9H7Br3O2)]
method: RPBEPBE
basis: SDD
operation: Freq
keyword: #p
keyword: freq=noraman
keyword: PBEPBE/SDD
title: #p freq=noraman PBEPBE/SDD
converged: YES YES NO NO
title: Mulliken charges:
elementType: Br Br Br O O C C C C C C C C C H H H H H H H
charge: 0.185854 0.153048 0.158864 -0.219512 -0.189314 0.477991 -0.436012 -0.365559 -0.377956 -0.223614 -0.223277 -0.225679 0.498824 -0.870131 0.244403 0.245959 0.233656 0.233326 0.232438 0.232508 0.234181
chargesum: 0.00000
title: Mulliken charges with hydrogens summed into heavy atoms:
elementType: Br Br Br O O C C C C C C C C C
charge: 0.185854 0.153048 0.158864 -0.219512 -0.189314 0.477991 0.054350 -0.131903 -0.144630 0.008824 0.009231 0.008502 0.498824 -0.870131
polarizability: 1.86776375e+02 1.28706135e-01 1.49684765e+02 3.56479008e+01 -1.33176210e+00 1.18811528e+02
1716.lowfreq: -10.4941 0.0002 0.0004 0.0006 2.9320 5.4841 7.4799 10.8364 33.5111
frequency: -8.0552 10.6544 33.4964 39.9210 72.0998 97.8250 144.7946 145.5978 164.8355 195.8973 215.1999 229.1539 293.1049 324.5318 355.9270 402.0438 494.5360 539.3247 565.0672 617.1496 667.3714 690.2656 703.2811 732.9649 758.1958 814.6010 851.3366 853.4092 914.8195 933.4530 943.8313 978.5752 991.2221 1000.3548 1027.2652 1089.5645 1132.3752 1174.9837 1189.3940 1189.6262 1231.6622 1327.7006 1345.1737 1387.5452 1442.0527 1467.7070 1488.3341 1596.7373 1617.5035 1626.5909 3021.1103 3089.9531 3124.8938 3125.8543 3138.5346 3152.4815 3168.1221
redmass: 4.0153 7.8502 10.6797 9.1659 6.6270 12.3237 22.8688 15.5726 11.2518 12.6449 12.1194 15.5458 10.8840 2.1894 6.9637 2.7850 3.9630 12.2864 5.1910 6.3320 8.9680 7.2110 1.9013 11.9088 2.0272 5.6136 4.3973 1.2483 7.1872 1.6504 1.6483 1.3947 6.1611 1.3307 2.1787 1.5217 8.4671 1.0546 1.1057 1.0982 2.3009 1.2724 1.4346 8.7874 2.1978 1.1071 2.4403 6.1284 6.1698 11.9586 1.0578 1.1086 1.0861 1.0888 1.0916 1.0962 1.1016
irintensity: 0.0265 0.0197 1.5972 0.3151 0.0995 0.0542 0.9040 0.2399 2.8802 0.1098 0.5550 10.6874 1.7636 0.7575 5.1835 0.0078 22.9128 135.9825 14.9823 0.1544 29.0803 70.6292 92.9250 35.8158 99.5421 30.7224 56.2605 0.0523 125.3471 7.2310 2.3988 0.0776 1.3136 0.0279 2.5613 7.0367 480.9725 0.0376 0.9031 3.0176 8.5310 0.2866 36.5321 0.8956 9.9207 5.4667 3.1699 0.8453 0.9232 182.6007 12.6625 8.1874 5.5710 2.9415 11.5683 32.2067 18.8548
temp: 298.150 k
press: 1.00000 atm
elementType: 35 35 35 8 8 6 6 6 6 6 6 6 6 6 1 1 1 1 1 1 1
symmnumber: 1
zpe: 358461.0 jmol-1
zpe.correction: 0.136531 hartree
zpe.thermalcorrener: 0.150528 hartree
zpe.thermalcorrenthalpy: 0.151472 hartree
zpe.thermalcorrgfe: 0.090276 hartree
zpe.sumelectzpe: -536.934189 hartree
zpe.sumelectthermal: -536.920191 hartree
zpe.sumelectthermalent: -536.919247 hartree
zpe.sumelectthermalfe: -536.980443 hartree
dipole: -3.7291 0.0563 -0.3125
dipole: 3.7426
quadrupole: -94.1992 -100.3416 -113.6053
quadrupole: 0.1742 0.0770 0.1411
quadrupole: 8.5162 2.3738 -10.8900 0.1742 0.0770 0.1411
hfenergy: -537.0707196 hartree
pointgroup: C01 [X(C9H7Br3O2)]
dipole: -1.4722462 -0.0192567 -0.014629 debye
dipolederiv: -0.7409588 -0.3039065 -0.0703036 -0.281193 -0.1303138 -0.026661 -0.0721649 -0.0271967 -0.0517622 -0.1092167 -0.0373104 -0.1099884 0.0044318 -0.1956674 -0.297496 -0.0930032 -0.2598926 -0.7085173 -0.1257154 -0.1048261 0.1453997 -0.0669132 -0.349889 0.3766826 0.137885 0.3411459 -0.5145208 -2.1372673 0.0657761 -0.0132957 0.2180842 -0.4228277 -0.0166433 -0.0305158 -0.0171877 -0.1771099 -0.7661174 0.1086028 -0.0010239 -0.3404753 -0.8490891 -0.0581916 -0.0398897 -0.0484377 -0.2193249 -0.1113474 0.0159818 -0.0003977 -0.1292395 -0.1164808 0.0028788 0.0005967 0.001387 -0.0172853 1.3963211 -0.0101666 -0.0017159 -0.3735805 0.356952 -0.0068579 -0.0236005 -0.0106193 0.2939885 -0.028683 0.0529879 -0.0985437 0.0526126 -0.1077131 -0.0232625 0.028501 -0.0157213 0.0390751 -0.0363586 0.0537437 0.0972844 0.0579323 -0.106066 0.0267396 -0.0342181 0.0178538 0.041034 -0.0970812 0.038135 0.1038734 0.0382472 -0.1189601 0.0582668 0.1301004 0.0461615 0.071484 -0.0936238 0.0364887 -0.1056972 0.0345352 -0.120276 -0.0543305 -0.1302348 -0.0416398 0.0723844 0.0556187 0.1180957 -0.0009615 0.1062958 -0.0837465 0.0005822 -0.0016727 0.000191 -0.0295554 1.8720181 -0.2908598 0.0010418 0.2249137 1.0817202 0.0970662 0.0566825 0.0960603 0.0011049 0.8818006 0.6031569 0.0512559 0.6224944 0.5265932 -0.0733793 0.0567767 -0.0831297 1.379067 -0.0675873 -0.0165364 0.023785 0.0904918 0.0186258 0.0339504 0.0421886 0.0951344 -0.0374656 -0.0543836 -0.0147139 -0.0241618 0.0900126 0.02592 -0.0313624 -0.0328965 -0.0861322 -0.0360859 0.0675768 -0.0533789 0.0946029 -0.0532889 0.1144157 0.0371697 0.0857047 0.0308727 -0.0366323 0.0670309 -0.0549682 -0.093825 -0.0553223 0.1119316 -0.0410016 -0.0828794 -0.03432 -0.0358998 0.0493752 -0.048844 -0.0712117 -0.0612373 0.1310351 -0.0388137 -0.0916357 -0.0414482 -0.0613608 0.0485291 -0.0473776 0.0732324 -0.0597123 0.1324797 0.0348977 0.0934283 0.0372138 -0.0622199 -0.0699302 -0.1100803 0.0006506 -0.1190893 0.1013561 -0.0002339 0.0008474 -0.000295 0.0896023 unknown
polarizability: 191.4281706|30.5401627|114.1198836|0.8004269|-0.0759588|149.7246133 unknown
InChI: InChI=1S/C9H7Br3O2/c10-9(11,12)8(13)14-6-7-4-2-1-3-5-7/h1-5H,6H2
charge 0 multiplicity 1
21 atoms
Br 4.877142 0.147941 0.151065
Br 2.788756 -1.428569 -1.830076
Br 2.61108 -1.833758 1.44958
O  0.706591 0.198241 -0.032374
O  2.329912 1.862283 0.146784
C  -1.704824 0.581002 0.009526
C  -0.37037 1.273319 0.006667
C  -2.339922 0.241085 -1.211842
C  -2.345364 0.264396 1.234119
C  -3.593808 -0.407883 -1.209834
C  -3.599999 -0.383649 1.239007
C  -4.226448 -0.720312 0.016326
C  1.997119 0.665446 0.041609
C  3.004379 -0.521582 -0.033966
H  -0.213689 1.908621 -0.882549
H  -0.192033 1.87557 0.914182
H  -1.849184 0.48085 -2.163002
H  -1.859351 0.523093 2.182753
H  -4.077203 -0.667076 -2.157921
H  -4.088197 -0.623343 2.189767
H  -5.201087 -1.220875 0.018878
