program: Gaussian 09
title: 000119581
version: EM64L-G09RevD.01
frameworkgroup: C1[X(C12H14O14)]
method: RPBEPBE
basis: SDD
operation: Freq
keyword: #p
keyword: freq=noraman
keyword: PBEPBE/SDD
title: #p freq=noraman PBEPBE/SDD
converged: YES YES NO NO
title: Mulliken charges:
elementType: O O O O O O O O O O O O O O C C C C C C C C C C C C H H H H H H H H H H H H H H
charge: -0.292669 -0.281633 -0.423395 -0.420007 -0.197913 -0.185532 -0.425414 -0.422420 -0.212292 -0.220384 -0.404455 -0.404839 -0.250919 -0.256755 -0.086303 -0.102452 -0.073662 -0.047525 -0.528043 -0.532701 0.187806 0.141982 0.171237 0.165054 0.217995 0.227677 0.279872 0.285109 0.326946 0.328874 0.282888 0.289100 0.289097 0.273953 0.380495 0.382743 0.389103 0.386278 0.382127 0.380977
chargesum: 0.00000
title: Mulliken charges with hydrogens summed into heavy atoms:
elementType: O O O O O O O O O O O O O O C C C C C C C C C C C C
charge: -0.292669 -0.281633 -0.042900 -0.037264 -0.197913 -0.185532 -0.036311 -0.036142 -0.212292 -0.220384 -0.022328 -0.023862 -0.250919 -0.256755 0.193569 0.182656 0.253284 0.281349 0.043945 0.030349 0.187806 0.141982 0.171237 0.165054 0.217995 0.227677
polarizability: 1.83526023e+02 4.09215177e+00 1.84132090e+02 4.91009852e-01 2.08473892e+00 1.60714631e+02
1716.lowfreq: -0.0005 0.0007 0.0010 5.4206 5.6440 7.3795 17.3184 22.9145 30.1144
frequency: 17.1366 22.7510 30.0570 38.7312 45.4674 50.6802 53.3077 60.6413 66.3766 70.0938 82.7252 87.1331 100.1769 105.9002 119.8096 128.9543 129.7153 137.7335 182.5723 201.5084 214.6912 247.0113 265.1020 275.1452 284.0983 289.8975 324.6949 331.0794 358.3617 395.0645 415.8105 459.8186 466.6595 474.4631 489.6587 511.5040 525.6175 550.8597 555.8338 563.5574 573.9142 588.4750 596.9049 598.4923 617.3111 628.3675 631.0375 645.0250 652.2464 669.4866 680.9973 686.2181 713.6116 828.0157 833.9391 849.3212 856.5741 897.8813 909.9810 917.0277 925.9320 983.6296 991.6255 1021.0745 1026.1356 1028.1794 1034.7991 1055.1044 1058.8682 1065.1027 1076.4249 1084.0657 1112.1811 1118.1234 1210.8429 1213.7308 1218.3830 1228.8760 1251.5049 1257.0193 1257.7381 1274.1283 1276.6975 1287.2788 1299.4719 1301.4001 1324.2376 1326.5857 1352.2469 1358.8376 1384.4710 1387.0744 1422.2293 1423.6617 1657.3216 1662.3801 1665.5080 1668.3572 1688.2027 1693.6829 2963.3193 2978.6129 3026.2039 3030.0209 3047.7931 3058.7648 3088.3580 3092.2064 3509.0411 3513.8095 3515.7853 3516.0875 3519.7378 3522.5632
redmass: 9.0344 8.5366 8.3020 8.4911 9.5819 10.7965 8.9455 8.1389 9.1894 10.4226 10.0454 6.5318 7.0690 12.2733 6.2726 6.7897 4.4216 6.3410 7.5501 5.7276 5.4099 8.3218 7.8259 5.8921 7.3385 5.1558 5.5903 7.2740 4.9002 6.2992 5.5849 4.1861 4.2442 2.8458 2.3209 2.3467 3.1552 1.7860 2.0329 2.6873 2.6153 1.7598 2.4558 2.7903 3.4492 2.5092 2.2905 1.5103 1.5295 2.5468 3.6389 3.6726 4.8364 4.8460 4.9431 5.2092 4.6312 4.3552 4.5052 3.9967 4.4137 3.8445 3.6020 4.4064 2.9004 3.6288 3.8293 2.6831 2.5568 2.7078 2.7329 2.5765 3.1087 2.8936 1.2979 1.2643 1.2162 1.3057 1.4089 1.4211 1.4381 1.7732 1.7118 1.4406 1.5862 1.5313 1.6333 1.5441 1.4024 1.5353 1.8894 1.8507 1.0926 1.0943 8.9711 8.5653 9.1169 8.9243 9.6096 9.6471 1.0826 1.0828 1.0604 1.0604 1.0840 1.0854 1.0997 1.0999 1.0641 1.0640 1.0640 1.0643 1.0642 1.0642
irintensity: 0.0729 0.8683 0.7142 0.4941 2.2295 0.0152 0.9468 0.6263 4.1149 1.4503 1.3886 1.2841 1.1602 0.6975 0.4280 0.1874 4.0757 1.2320 0.2290 1.3171 1.2510 0.0571 3.1815 0.2246 3.4315 0.9132 1.6451 0.2112 3.8591 7.6678 18.3068 26.8270 32.4496 1.5921 7.9450 90.7103 33.3397 86.6010 88.7151 51.6371 180.0431 110.5385 59.7635 27.9552 10.1530 18.3201 141.8688 70.8428 135.4463 6.9400 42.0763 41.8470 17.5652 0.5808 1.0950 6.2429 15.4484 27.0755 19.9553 0.8843 12.9721 118.9724 80.8424 490.6879 96.5079 200.8614 546.1395 155.8435 247.2490 29.1845 33.0404 11.8141 83.1863 58.2223 5.5225 5.4617 0.0624 1.3526 0.1710 2.4518 0.0189 22.1265 30.0267 18.6298 43.7256 44.2522 29.3946 3.1019 20.2055 4.3793 57.3347 62.3490 56.5200 39.2535 223.9082 206.8091 267.6487 275.2708 84.9056 362.1779 67.4434 73.4161 5.7501 4.9430 1.7485 3.5146 0.2919 0.4957 25.9012 32.3561 29.3540 37.1296 23.0261 32.3906
temp: 298.150 k
press: 1.00000 atm
elementType: 8 8 8 8 8 8 8 8 8 8 8 8 8 8 6 6 6 6 6 6 6 6 6 6 6 6 1 1 1 1 1 1 1 1 1 1 1 1 1 1
symmnumber: 1
zpe: 718720.3 jmol-1
zpe.correction: 0.273746 hartree
zpe.thermalcorrener: 0.301355 hartree
zpe.thermalcorrenthalpy: 0.302299 hartree
zpe.thermalcorrgfe: 0.211692 hartree
zpe.sumelectzpe: -1516.828059 hartree
zpe.sumelectthermal: -1516.800450 hartree
zpe.sumelectthermalent: -1516.799506 hartree
zpe.sumelectthermalfe: -1516.890113 hartree
dipole: 0.4270 -4.4269 0.6457
dipole: 4.4941
quadrupole: -138.5597 -132.0452 -138.9746
quadrupole: 5.9599 15.6238 -0.5740
quadrupole: -2.0332 4.4813 -2.4481 5.9599 15.6238 -0.5740
hfenergy: -1517.1018047 hartree
pointgroup: C01 [X(C12H14O14)]
dipole: 0.3461685 -0.2240469 -1.7193663 debye
polarizability: 175.7139084|-9.6477311|168.5439749|0.1453734|-6.7585299|184.1148608 unknown
InChI: InChI=1S/C12H14O14/c13-5(14)1-3(9(17)18)25-7(11(21)22)8(12(23)24)26-4(10(19)20)2-6(15)16/h3-4,7-8,13,15,17,19,21,23H,1-2H2
charge 0 multiplicity 1
40 atoms
O  1.29394 -0.125072 0.198814
O  -1.723257 0.415963 0.580261
O  0.578328 -1.818878 3.334134
O  -0.39996 1.076682 3.849782
O  2.431251 -0.537515 2.746247
O  -2.372174 0.008661 3.227931
O  2.567852 -3.114088 -1.601061
O  -2.064688 3.350675 -1.613248
O  2.078249 -2.890573 0.655678
O  -1.64231 3.259981 0.667973
O  3.182995 1.721666 -2.942466
O  -3.644184 -1.415188 -2.462288
O  0.934689 1.287465 -2.597059
O  -1.393169 -1.458721 -1.933474
C  0.418237 -0.611689 1.272917
C  -0.617416 0.531104 1.532866
C  1.593061 -1.019074 -0.924596
C  -1.61321 1.163875 -0.672177
C  2.663124 -0.282932 -1.747162
C  -2.72699 0.607742 -1.570852
C  1.28812 -0.952262 2.494447
C  -1.263853 0.476838 2.9229
C  2.100238 -2.40039 -0.490523
C  -1.777952 2.670626 -0.423413
C  2.130366 0.954785 -2.438277
C  -2.474137 -0.829827 -1.975248
H  -0.150089 -1.513366 0.983335
H  -0.087813 1.496519 1.445979
H  0.67075 -1.183623 -1.522301
H  -0.6259 1.016014 -1.156202
H  3.50137 0.011554 -1.091748
H  3.071588 -0.956704 -2.521748
H  -2.806868 1.219441 -2.487337
H  -3.700169 0.660538 -1.053128
H  1.134488 -2.038127 4.129239
H  -0.800833 1.022978 4.759077
H  2.835334 -4.030929 -1.319755
H  -2.103995 4.329405 -1.4335
H  2.818597 2.521048 -3.411298
H  -3.457306 -2.353401 -2.739119
