program: Gaussian 09
title: 000118307
version: EM64L-G09RevD.01
frameworkgroup: C1[X(C14H21N3O)]
method: RPBEPBE
basis: SDD
operation: Freq
keyword: #p
keyword: freq=noraman
keyword: PBEPBE/SDD
title: #p freq=noraman PBEPBE/SDD
converged: YES YES NO NO
title: Mulliken charges:
elementType: O N N N C C C C C C C C C C C C C C H H H H H H H H H H H H H H H H H H H H H
charge: -0.225260 -0.076499 -0.067232 -0.460149 -0.171034 -0.427335 -0.370153 -0.361628 0.126648 -0.636425 -0.618267 0.327539 0.267035 -0.345273 -0.384609 -0.846898 -0.236083 -0.249125 0.189011 0.236963 0.213157 0.209921 0.184153 0.203244 0.196586 0.257429 0.177525 0.226907 0.223712 0.193367 0.221669 0.326586 0.307359 0.227811 0.230084 0.245582 0.228692 0.228037 0.226955
chargesum: 0.00000
title: Mulliken charges with hydrogens summed into heavy atoms:
elementType: O N N N C C C C C C C C C C C C C C
charge: -0.225260 -0.076499 -0.067232 -0.133563 0.017977 0.022785 0.023920 0.038202 0.126648 0.025436 0.020481 0.327539 0.267035 -0.037914 -0.156798 -0.142539 -0.008046 -0.022171
polarizability: 2.52159926e+02 -2.03973925e+00 1.48205455e+02 1.61899584e+00 1.86269524e+01 1.41635206e+02
1716.lowfreq: -24.6272 -13.2042 -3.5264 -0.0003 0.0005 0.0006 10.8172 29.3175 60.2511
frequency: -14.4908 28.9007 60.0582 85.3635 96.4388 139.8772 148.2852 184.2160 191.7456 196.1693 210.0637 226.4860 232.7040 264.3163 283.8827 305.2552 319.1805 340.1969 369.6008 399.0932 400.9748 419.8403 446.2781 482.1176 527.8900 543.3975 582.8017 600.6770 661.8893 679.9352 723.6791 731.0331 769.0685 778.7691 792.4455 806.3837 836.6940 882.9929 883.7697 949.9871 955.3913 977.2469 979.9930 998.2074 1020.4946 1034.5328 1042.5364 1045.8814 1050.2615 1069.2726 1095.6542 1108.1162 1110.2028 1128.9790 1139.8287 1152.8571 1166.8095 1173.7555 1179.2200 1197.3959 1230.6911 1247.4688 1262.8103 1272.0733 1288.8388 1293.6907 1307.7161 1335.9928 1349.1216 1367.7797 1371.8419 1376.5819 1394.5394 1430.7461 1432.9467 1439.1896 1451.7481 1452.0445 1458.6237 1460.7931 1468.8797 1473.9872 1475.9374 1481.0119 1482.4112 1487.7568 1515.3244 1595.0157 1618.0398 1624.7503 2778.6831 2839.3956 2854.9788 2863.3285 2874.5261 2906.8919 2953.1930 3018.9349 3021.8250 3028.1698 3029.6094 3031.8957 3034.9571 3076.3076 3087.0943 3087.3605 3121.7412 3137.6225 3160.5783 3191.8194 3526.0387
redmass: 3.8326 4.3480 3.3154 5.1713 2.9478 3.9694 2.9854 4.1597 2.2545 1.1979 1.8713 1.5235 1.1306 2.3648 4.2579 3.5149 2.2920 3.7113 2.4424 3.1806 3.5607 3.0837 2.9834 3.2428 4.3995 3.1144 3.1915 3.6847 1.1973 6.2405 5.4261 2.7161 1.3917 3.6932 4.7622 2.7755 4.3648 1.3152 2.2989 2.6210 1.3695 2.2684 1.7098 1.3075 2.4066 1.8893 1.5295 2.1527 2.0034 1.7602 2.0032 1.5135 1.6735 1.6036 2.5089 2.8081 1.9433 1.0911 1.7174 1.9912 1.9009 2.2433 1.6439 2.2086 1.4645 1.5882 1.3083 1.4415 1.4181 1.4220 1.5582 4.2172 1.2779 1.1617 1.1616 2.3471 1.7904 1.0780 1.0914 1.0664 1.0568 1.1010 1.0601 1.0447 1.0525 1.4328 1.9865 6.2103 5.9787 4.8371 1.0792 1.0609 1.0672 1.0595 1.0659 1.0669 1.0399 1.0740 1.0978 1.0900 1.0723 1.0915 1.0888 1.1009 1.0967 1.0990 1.0872 1.0901 1.0984 1.0952 1.0756
irintensity: 0.4930 0.4354 0.3636 3.4393 2.4726 2.0479 4.1383 0.3902 3.2101 0.0018 0.2658 1.6274 0.5944 1.5469 3.3416 2.8106 10.1611 3.8872 2.1346 1.1382 0.1629 0.5239 7.7786 3.9200 2.9104 4.6037 1.7786 4.3339 46.6037 10.4352 5.1909 3.2177 85.6864 10.9068 11.8019 6.4790 1.3076 3.6874 8.4868 2.6472 3.5473 18.7098 0.9675 1.9114 10.8431 0.8194 6.6268 14.2351 20.7006 6.0636 49.2858 7.1453 17.1992 3.6079 42.6955 66.9370 7.6840 0.0645 29.1196 5.1618 6.3161 5.0210 11.8431 22.6528 52.4745 22.9490 15.6075 2.3220 3.5907 6.5372 5.3128 63.2543 23.2229 1.9469 2.2646 79.9456 111.4653 2.3413 30.0983 10.0278 32.3033 10.2365 6.8310 17.0543 9.8708 57.0937 295.3651 80.6399 3.6820 85.7180 90.8729 80.2019 124.5288 46.1022 194.7706 70.0404 32.8891 44.0943 21.5449 31.5150 27.9192 79.2112 27.4571 35.4289 40.1036 15.5970 8.9166 19.1356 30.0515 9.1792 15.5922
temp: 298.150 k
press: 1.00000 atm
elementType: 8 7 7 7 6 6 6 6 6 6 6 6 6 6 6 6 6 6 1 1 1 1 1 1 1 1 1 1 1 1 1 1 1 1 1 1 1 1 1
symmnumber: 1
zpe: 868981.7 jmol-1
zpe.correction: 0.330978 hartree
zpe.thermalcorrener: 0.347989 hartree
zpe.thermalcorrenthalpy: 0.348934 hartree
zpe.thermalcorrgfe: 0.286764 hartree
zpe.sumelectzpe: -784.180363 hartree
zpe.sumelectthermal: -784.163352 hartree
zpe.sumelectthermalent: -784.162407 hartree
zpe.sumelectthermalfe: -784.224577 hartree
dipole: -0.3718 2.6951 2.6798
dipole: 3.8188
quadrupole: -95.5451 -106.2004 -111.7761
quadrupole: 1.4091 1.9554 -1.0141
quadrupole: 8.9621 -1.6932 -7.2689 1.4091 1.9554 -1.0141
hfenergy: -784.5113408 hartree
pointgroup: C01 [X(C14H21N3O1)]
dipole: 0.1518933 0.7763612 1.2772949 debye
polarizability: 251.8861032|5.6046452|133.5091638|-3.1459525|14.8046726|156.6053209 unknown
InChI: InChI=1S/C14H21N3O/c1-11-6-4-5-7-12(11)15-14(18)13-10-16(2)8-9-17(13)3/h4-7,13,15H,8-10H2,1-3H3
charge 0 multiplicity 1
39 atoms
O  0.166117 -0.942948 -1.604808
N  2.375486 -1.003737 0.557273
N  3.748539 1.310869 -0.508808
N  -0.835841 0.199529 0.194243
C  1.616727 0.168091 0.052034
C  2.436556 0.888053 -1.044818
C  3.701854 -0.585693 1.072597
C  4.506945 0.137371 -0.016886
C  0.257127 -0.262734 -0.54235
C  1.624251 -1.815307 1.533667
C  4.515175 2.123007 -1.472942
C  -2.22965 0.01909 -0.045241
C  -3.139858 0.585648 0.904285
C  -2.715823 -0.692178 -1.174187
C  -4.525924 0.418075 0.685375
C  -2.638099 1.34783 2.120646
C  -4.106285 -0.840295 -1.360834
C  -5.018979 -0.287828 -0.435729
H  1.441778 0.908117 0.883247
H  2.528596 0.1875 -1.908808
H  1.884726 1.785136 -1.383325
H  4.248209 -1.491022 1.396309
H  3.603186 0.095782 1.956459
H  5.467445 0.486282 0.406881
H  4.731197 -0.585163 -0.841699
H  0.703157 -2.208588 1.0710
H  1.341366 -1.250523 2.460132
H  2.242644 -2.678061 1.837942
H  3.928448 3.014872 -1.757716
H  4.7784 1.56953 -2.409291
H  5.45408 2.467492 -1.003126
H  -0.594233 0.730532 1.033863
H  -2.000727 -1.115705 -1.881539
H  -5.229044 0.849022 1.408254
H  -2.046192 2.24293 1.840821
H  -3.484061 1.702052 2.732234
H  -2.006095 0.717531 2.779171
H  -4.472276 -1.390432 -2.234729
H  -6.098321 -0.403028 -0.581496
