program: Gaussian 09
title: 000118155
version: EM64L-G09RevD.01
frameworkgroup: C1[X(C13H18O2)]
method: RPBEPBE
basis: SDD
operation: Freq
keyword: #pfreq=noraman
keyword: PBEPBE/SDD
title: #p freq=noraman PBEPBE/SDD
converged: YES YES NO NO
title: Mulliken charges:
elementType: O O C C C C C C C C C C C C C H H H H H H H H H H H H H H H H H H
charge: -0.289769 -0.256418 -0.064850 0.027181 -0.596134 -0.745221 0.495438 -0.737027 -0.414788 -0.404276 -0.229964 -0.238235 0.297799 -0.243424 -0.757766 0.211813 0.275378 0.202715 0.225839 0.210177 0.219000 0.237850 0.226767 0.216834 0.245270 0.229541 0.241316 0.222411 0.227626 0.227313 0.244903 0.247988 0.244716
chargesum: 0.00000
title: Mulliken charges with hydrogens summed into heavy atoms:
elementType: O O C C C C C C C C C C C C C
charge: -0.289769 -0.256418 0.146962 0.302559 -0.167580 -0.078195 0.495438 -0.048157 -0.185247 -0.162960 -0.007554 -0.010609 0.297799 -0.016111 -0.020158
polarizability: 1.63060208e+02 -2.58673568e+00 1.55004275e+02 1.82741672e+01 -4.00184418e+00 1.05422624e+02
1716.lowfreq: -15.0871 -13.7999 -8.4683 -3.5387 -0.0007 -0.0006 0.0002 28.0471 33.9225
frequency: -14.8890 28.0410 33.8548 49.4863 66.5322 88.6674 103.2096 156.6292 186.4126 187.0258 217.9167 224.9935 286.5983 314.3982 335.6133 356.1367 401.8903 410.2753 463.6337 517.2450 546.2217 567.5582 594.9590 597.5895 617.9184 703.7996 743.4275 776.7288 804.0525 809.5184 851.4683 887.3873 903.0391 916.5443 931.2619 973.5417 983.5228 990.2025 993.0777 996.5288 1007.0029 1026.7473 1040.6960 1049.3241 1088.8468 1101.6848 1135.9208 1156.7560 1171.1895 1185.0755 1187.4507 1207.0355 1215.2029 1273.7013 1305.2411 1318.2381 1328.8233 1337.2478 1353.7225 1380.3756 1381.5086 1382.5322 1386.6872 1439.4724 1453.1424 1455.7953 1463.2418 1469.1085 1472.9440 1482.8149 1484.9917 1489.1046 1591.6303 1613.4711 1640.4705 2971.3203 2984.5570 2988.9671 2992.1015 3004.7806 3027.3678 3047.0004 3075.2880 3087.2978 3088.8800 3097.3803 3101.9830 3110.1085 3120.2279 3131.3521 3138.6899 3143.5992 3161.9126
redmass: 4.8390 5.7053 3.6627 1.0694 3.6418 3.2859 3.0015 2.2374 1.3369 3.3977 1.2721 3.3496 2.2303 3.8145 2.4297 2.5652 2.8039 2.9424 3.2559 2.7946 3.1597 3.3759 4.3139 3.7985 6.2845 1.7827 2.0333 2.6900 2.9068 3.0161 1.2508 2.0286 2.3087 1.8405 1.6734 1.3982 1.5968 5.3185 1.3474 1.8304 1.7511 2.1591 1.6594 1.7192 1.7432 2.0311 1.9263 2.0144 1.0618 1.3736 1.1286 2.9771 2.4963 1.3115 1.3094 1.5081 1.2728 1.4541 1.4624 1.3621 2.0446 1.8629 1.2114 2.1644 1.0610 1.0520 1.0555 1.0578 1.0872 1.9972 1.1413 1.0501 5.9851 6.1822 9.3256 1.0809 1.0397 1.0578 1.0366 1.0379 1.0855 1.1017 1.0991 1.0981 1.0996 1.0947 1.1003 1.0872 1.0863 1.0911 1.1021 1.0958 1.1014
irintensity: 1.6628 0.6115 0.9834 0.2380 0.1404 1.3667 2.1625 3.7181 1.0350 1.1454 0.7161 3.9173 0.4198 3.3606 0.5135 2.7920 0.0543 3.1830 10.2721 6.9339 3.1900 6.0427 6.3716 3.6224 0.1331 49.8515 36.5369 16.1091 6.4414 2.9521 0.2983 11.3875 22.4875 19.4967 4.0069 0.0979 4.0784 0.3052 1.4431 82.0876 17.5696 5.8637 11.9088 25.5442 11.3275 23.1755 0.9713 42.7534 0.6695 40.7183 1.4115 268.1335 1.5437 2.9697 0.7965 0.9449 0.4496 5.5755 3.6080 14.5870 32.3291 31.3318 21.6144 8.5618 25.9587 16.3130 8.4573 4.7815 16.1043 12.7323 18.4490 4.8482 1.3421 5.0024 161.6875 12.9758 17.1319 50.5939 21.3983 3.3261 5.5773 15.6595 40.3214 23.5030 36.4021 9.3800 19.6363 9.8227 5.6475 13.9721 9.2438 44.0190 21.8256
temp: 298.150 k
press: 1.00000 atm
elementType: 8 8 6 6 6 6 6 6 6 6 6 6 6 6 6 1 1 1 1 1 1 1 1 1 1 1 1 1 1 1 1 1 1
symmnumber: 1
zpe: 729524.2 jmol-1
zpe.correction: 0.277861 hartree
zpe.thermalcorrener: 0.293282 hartree
zpe.thermalcorrenthalpy: 0.294226 hartree
zpe.thermalcorrgfe: 0.233669 hartree
zpe.sumelectzpe: -655.502046 hartree
zpe.sumelectthermal: -655.486625 hartree
zpe.sumelectthermalent: -655.485681 hartree
zpe.sumelectthermalfe: -655.546239 hartree
dipole: -0.6531 1.8289 -0.7924
dipole: 2.0974
quadrupole: -82.6782 -88.8813 -92.1464
quadrupole: 0.6581 5.6953 4.9931
quadrupole: 5.2238 -0.9793 -4.2444 0.6581 5.6953 4.9931
hfenergy: -655.7799074 hartree
pointgroup: C01 [X(C13H18O2)]
dipole: 0.2016956 -0.7647431 -0.2354354 debye
polarizability: 162.1537578|-5.0036978|155.9686101|-18.3076082|0.0202916|105.3647391 unknown
InChI: InChI=1S/C13H18O2/c1-10(11(2)15-12(3)14)9-13-7-5-4-6-8-13/h4-8,10-11H,9H2,1-3H3
charge 0 multiplicity 1
33 atoms
O  2.295507 -0.226338 -0.222438
O  2.243937 1.967538 0.581646
C  0.459837 -1.790342 0.186882
C  1.301064 -0.662818 0.829225
C  -0.419601 -1.243538 -0.985666
C  1.31511 -2.986647 -0.290164
C  -1.529662 -0.301808 -0.539453
C  2.078957 -1.055509 2.091945
C  -2.757387 -0.82437 -0.052128
C  -1.367112 1.107769 -0.573349
C  -3.790552 0.032146 0.388615
C  -2.39745 1.969877 -0.133196
C  2.695247 1.111704 -0.214953
C  -3.613734 1.435363 0.349698
C  3.748082 1.355044 -1.276941
H  -0.22785 -2.143311 0.984748
H  0.658851 0.21054 1.04725
H  -0.862878 -2.116405 -1.503119
H  0.248362 -0.743427 -1.712183
H  0.667778 -3.779377 -0.707857
H  1.897193 -3.432601 0.535705
H  2.024187 -2.669971 -1.075166
H  2.840551 -1.823331 1.873859
H  1.385124 -1.457401 2.853147
H  2.5814 -0.172308 2.522002
H  -2.906351 -1.911839 -0.028364
H  -0.428529 1.535491 -0.946674
H  -4.732701 -0.391191 0.755823
H  -2.249089 3.055089 -0.166439
H  -4.414373 2.102453 0.688543
H  3.540754 0.761834 -2.181727
H  4.736233 1.044348 -0.890837
H  3.789794 2.427437 -1.519232
