program: Gaussian 09
title: 000118015
version: EM64L-G09RevD.01
frameworkgroup: C1[X(C14H14N2O2)]
method: RPBEPBE
basis: SDD
operation: Freq
keyword: #p
keyword: freq=noraman
keyword: PBEPBE/SDD
title: #p freq=noraman PBEPBE/SDD
converged: YES YES NO NO
title: Mulliken charges:
elementType: O O N N C C C C C C C C C C C C C C H H H H H H H H H H H H H H
charge: -0.287793 -0.180181 -0.383789 -0.096393 0.154252 -0.340931 0.238174 0.510463 -0.691280 -0.733514 0.025478 -0.361432 -0.399576 0.268307 -0.222530 -0.223252 -0.238922 -0.510679 0.264475 0.336008 0.211502 0.296913 0.220956 0.245463 0.226498 0.228153 0.238568 0.237006 0.225712 0.228236 0.229792 0.284318
chargesum: 0.00000
title: Mulliken charges with hydrogens summed into heavy atoms:
elementType: O O N N C C C C C C C C C C C C C C
charge: -0.287793 -0.180181 -0.047780 -0.096393 0.154252 -0.076457 0.238174 0.510463 0.038090 -0.033400 0.025478 -0.122864 -0.162569 0.268307 0.003182 0.004984 -0.009131 -0.226362
polarizability: 2.20809998e+02 -6.94479475e+00 1.58320726e+02 1.13167809e+01 7.49921284e+00 1.22667934e+02
1716.lowfreq: -15.3636 -7.7706 -6.8280 0.0006 0.0007 0.0008 2.1836 24.7332 36.0982
frequency: -13.3571 24.6574 36.0752 67.7404 88.5427 119.5489 157.8578 162.8947 182.1803 223.0394 228.9492 232.4465 264.3175 273.7548 299.4323 355.1703 390.6078 401.2130 430.3496 454.9069 500.7567 524.1797 526.8367 570.5884 586.4010 613.5502 641.5403 641.7657 670.9226 671.9980 689.1376 700.6441 722.3537 735.4224 758.3559 832.1608 840.0998 848.7522 908.8602 912.2726 930.5170 937.3309 945.2747 969.4216 974.8706 989.4883 995.9152 1019.1131 1027.4582 1084.9852 1104.1130 1161.5884 1173.5926 1178.3127 1188.0514 1192.5187 1212.0288 1214.4707 1234.6157 1281.5798 1331.5815 1379.2092 1387.2055 1396.2783 1440.2174 1455.4507 1463.1186 1476.1129 1484.2654 1484.6155 1497.6085 1595.9567 1600.4739 1614.5812 1701.2769 2139.0864 2989.1964 2996.3320 3050.9941 3085.8815 3097.8739 3114.7207 3121.6451 3125.6750 3131.4450 3143.5130 3153.8112 3167.5528 3427.4287 3538.3283
redmass: 3.7998 5.5588 4.3668 5.5831 6.6653 5.4272 5.4161 3.1739 4.0173 1.0669 4.4760 4.3839 3.0350 1.3609 3.3172 2.7273 3.9126 2.8133 4.5940 4.7073 4.2240 1.2451 4.8736 5.6041 5.6673 6.4700 1.8625 2.5172 1.3692 4.5825 9.2637 1.8725 3.2115 6.3111 2.4231 4.1481 4.2677 1.2779 2.6469 2.4008 2.2407 2.8426 1.9437 2.8361 1.3965 5.9332 1.3336 1.3367 2.1297 1.6049 5.4113 3.3013 1.0612 1.6555 1.1257 2.1171 2.2266 2.3740 2.9639 1.7571 1.2849 1.1874 7.5563 1.2000 2.1795 1.0558 1.0807 1.0534 2.1617 1.4076 1.1538 6.1864 11.5482 6.1960 12.0694 6.0028 1.0361 1.0355 1.0857 1.1012 1.1003 1.0989 1.1012 1.0850 1.0879 1.0922 1.0963 1.1016 1.1602 1.0769
irintensity: 0.5004 0.8157 0.6233 1.1200 3.1521 2.3018 0.8788 1.4341 0.3027 0.0660 0.1071 5.5912 0.5990 0.3960 0.0820 2.9974 0.1850 0.6334 1.2153 1.9039 11.1899 94.3270 4.8200 12.0861 20.6655 0.4704 44.2061 25.2084 46.6573 32.4175 28.6789 33.3598 39.9700 16.1359 18.5576 25.8901 12.9869 0.4281 12.2290 7.0063 2.9842 91.5876 25.2749 10.9829 0.2104 1.2735 0.0429 3.6632 2.9029 7.4208 334.9678 69.1439 0.5917 27.5159 3.5902 19.6794 30.6328 26.1539 111.5736 20.8706 5.1196 20.9242 0.1944 42.5270 15.7272 9.8500 21.4868 4.5307 6.9133 116.9506 10.9401 19.4823 1074.7705 53.9421 57.0539 0.4955 17.2571 29.7168 9.0057 23.4855 23.9561 22.8653 2.0311 2.6321 0.7651 18.9963 34.0423 17.7308 58.3500 61.4136
temp: 298.150 k
press: 1.00000 atm
elementType: 8 8 7 7 6 6 6 6 6 6 6 6 6 6 6 6 6 6 1 1 1 1 1 1 1 1 1 1 1 1 1 1
symmnumber: 1
zpe: 650152.2 jmol-1
zpe.correction: 0.247630 hartree
zpe.thermalcorrener: 0.263867 hartree
zpe.thermalcorrenthalpy: 0.264811 hartree
zpe.thermalcorrgfe: 0.203312 hartree
zpe.sumelectzpe: -800.477361 hartree
zpe.sumelectthermal: -800.461124 hartree
zpe.sumelectthermalent: -800.460180 hartree
zpe.sumelectthermalfe: -800.521679 hartree
dipole: -2.4979 3.2435 -3.9497
dipole: 5.6885
quadrupole: -83.6193 -103.9059 -109.5709
quadrupole: -0.2743 3.6090 11.0089
quadrupole: 15.4128 -4.8738 -10.5389 -0.2743 3.6090 11.0089
hfenergy: -800.7249909 hartree
pointgroup: C01 [X(C14H14N2O2)]
dipole: -0.9324858 1.5305546 -1.3404177 debye
polarizability: 220.0555492|-9.876715|155.0839053|12.3300673|12.6061291|126.6592034 unknown
InChI: InChI=1S/C14H14N2O2/c1-4-14(2,3)16-13-15-12(17)11(18-13)10-8-6-5-7-9-10/h1,5-9,11,16H,2-3H3
charge 0 multiplicity 1
32 atoms
O  0.040756 -0.158806 -1.466142
O  0.912441 -2.576534 1.064167
N  -2.194334 0.288357 -1.033198
N  -0.957717 -1.25579 0.362373
C  -3.502288 0.328119 -0.29805
C  1.126949 -0.99331 -0.868139
C  -1.093769 -0.401023 -0.650039
C  2.302355 -0.148198 -0.429076
C  -4.044434 -1.108911 -0.069914
C  -4.477134 1.139142 -1.195323
C  0.381373 -1.726303 0.320626
C  2.121858 1.171946 0.051739
C  3.60057 -0.713911 -0.444096
C  -3.326788 1.027158 1.003913
C  3.230186 1.917607 0.507766
C  4.706893 0.030552 0.021334
C  4.525698 1.349587 0.496541
C  -3.207873 1.619698 2.077025
H  1.424782 -1.742223 -1.622051
H  -2.069073 0.93851 -1.812961
H  -4.203807 -1.60565 -1.043596
H  -3.329958 -1.69657 0.526561
H  -5.006673 -1.055235 0.467056
H  -5.459065 1.211487 -0.701582
H  -4.106934 2.166536 -1.365674
H  -4.609958 0.630176 -2.166982
H  1.12153 1.617729 0.057099
H  3.744745 -1.738419 -0.806676
H  3.083833 2.939936 0.873946
H  5.706823 -0.416854 0.010018
H  5.384372 1.929158 0.853136
H  -3.089359 2.111939 3.025001
