program: Gaussian 09
title: 000118057
version: EM64L-G09RevD.01
frameworkgroup: C1[X(C15H22N2O)]
method: RPBEPBE
basis: SDD
operation: Freq
keyword: #p
keyword: freq=noraman
keyword: PBEPBE/SDD
title: #p freq=noraman PBEPBE/SDD
converged: YES YES NO NO
title: Mulliken charges:
elementType: O N N C C C C C C C C C C C C C C C H H H H H H H H H H H H H H H H H H H H H H
charge: -0.260420 -0.393644 -0.064003 -0.251764 0.163525 -0.410469 -0.371235 -0.486961 0.495040 -0.241666 -0.381215 -0.346167 -0.475826 -0.371202 -0.689922 -0.229082 -0.222597 -0.242238 0.187793 0.204963 0.228065 0.216261 0.218946 0.230621 0.205209 0.298730 0.158821 0.227563 0.209592 0.199357 0.187142 0.196029 0.225139 0.275686 0.210557 0.212912 0.212702 0.223792 0.223873 0.226094
chargesum: 0.00000
title: Mulliken charges with hydrogens summed into heavy atoms:
elementType: O N N C C C C C C C C C C C C C C C
charge: -0.260420 -0.094915 -0.064003 -0.063971 0.163525 0.022559 0.063971 -0.051131 0.495040 0.144718 0.027734 0.037005 -0.250687 -0.095516 -0.053751 -0.005291 0.001276 -0.016144
polarizability: 1.92896546e+02 -2.33694578e+01 1.72725118e+02 -6.31153267e+00 2.16083604e+00 1.60844809e+02
1716.lowfreq: -20.1078 -8.7274 -4.2793 -0.0006 -0.0004 0.0003 0.5114 23.6572 35.1558
frequency: -19.5176 23.4664 35.0598 45.1633 48.0560 52.0325 97.8843 117.3322 132.0679 143.8278 188.8518 212.5896 226.7915 235.1834 249.7950 281.0464 311.1970 341.9886 403.3540 405.2738 417.6202 456.9572 498.5400 508.4825 562.5571 599.3222 613.7868 668.1189 704.1720 723.7340 740.9386 778.4599 808.1218 814.3265 842.5214 854.8003 867.4774 877.8243 891.4875 916.4663 925.0011 936.2354 940.0454 962.5312 976.9447 990.1783 996.8536 1024.1799 1030.7145 1054.9855 1072.5300 1082.3225 1083.3636 1104.1794 1122.1991 1126.5074 1144.9266 1170.9042 1178.3101 1183.8694 1193.1184 1198.9489 1209.3195 1222.8595 1260.8265 1266.8940 1271.0698 1273.3200 1281.1261 1313.9625 1315.9108 1329.2838 1333.6292 1345.5907 1351.0244 1380.9204 1387.2082 1390.6513 1440.7270 1453.6954 1458.9260 1469.4050 1470.9224 1474.2601 1476.6365 1480.9851 1484.1211 1491.4147 1495.7883 1595.0809 1611.9940 1630.0038 2881.4984 2912.7199 2955.9174 2962.4320 2964.1016 2972.9168 2989.2261 2999.6818 3007.5749 3016.9107 3031.5601 3038.3507 3055.0270 3068.5906 3071.3390 3072.3174 3106.0601 3124.2500 3137.5539 3153.2751 3164.9424 3548.1014
redmass: 3.5379 3.2548 3.1908 1.8566 4.2092 3.8528 2.5404 2.7034 2.3445 3.1422 3.4031 4.4620 4.4599 1.1476 3.8173 3.8851 2.1487 3.8510 2.4732 1.4995 3.4340 3.1260 3.5605 3.4769 3.7341 5.2132 6.1679 4.8909 1.8453 2.4463 1.0760 2.1080 1.1728 3.7858 3.8055 1.2497 1.4340 2.8014 2.0477 1.8409 2.6352 1.1710 2.4230 3.1424 1.3958 5.8747 1.3333 2.4640 3.2333 4.2659 2.1711 1.8004 2.1570 2.3516 2.7901 3.5563 1.4914 1.0580 1.3315 1.1110 1.3456 1.6479 1.4279 1.9630 1.5567 1.2031 1.2188 1.4552 1.0833 1.2397 1.1986 1.2714 1.3788 1.5176 1.3753 1.8091 2.1544 1.6054 2.1606 1.1810 1.1352 1.0700 1.2631 1.0706 1.0424 2.2967 1.0731 1.0909 1.2468 6.2053 6.0806 6.3439 1.0815 1.0656 1.0668 1.0669 1.0587 1.0364 1.0605 1.0621 1.0988 1.0941 1.0960 1.0935 1.1039 1.1046 1.0997 1.1009 1.0879 1.0863 1.0921 1.0961 1.1001 1.0774
irintensity: 5.7923 0.4051 0.1175 0.9119 0.2863 0.1822 0.6250 1.4083 3.6606 1.7573 9.4117 3.9275 0.2546 0.1073 3.5232 1.4634 8.4693 3.0556 17.0388 92.3720 6.8364 6.0839 5.7057 11.3300 0.4735 6.7059 0.0260 4.6466 43.8180 53.2665 7.2250 18.3753 1.2198 4.7549 2.5612 0.1002 0.9391 2.6469 13.9835 18.1788 9.0175 1.3036 4.2305 10.8814 0.0500 0.0539 1.0089 21.2165 7.9453 125.7771 6.5062 16.6712 8.2937 12.5481 5.7883 18.6146 14.0406 0.1677 10.8551 1.9643 8.4914 4.2234 5.9200 36.4154 1.9130 5.5559 1.3881 9.4455 0.2708 10.1879 26.4016 1.1113 21.9658 6.7608 29.3024 4.5606 5.2196 3.0133 10.1982 32.7775 9.3860 0.4432 30.6097 1.2009 12.1525 12.9120 6.2128 11.1841 45.4309 1.6578 11.1605 110.0478 48.9359 71.6116 41.3367 86.9357 48.8414 36.8936 36.6970 17.5273 11.0756 15.9622 39.7680 51.1164 19.7647 51.8268 67.5219 89.8499 11.8025 0.8918 29.7420 27.5426 15.9024 9.9424
temp: 298.150 k
press: 1.00000 atm
elementType: 8 7 7 6 6 6 6 6 6 6 6 6 6 6 6 6 6 6 1 1 1 1 1 1 1 1 1 1 1 1 1 1 1 1 1 1 1 1 1 1
symmnumber: 1
zpe: 899576.4 jmol-1
zpe.correction: 0.342631 hartree
zpe.thermalcorrener: 0.360395 hartree
zpe.thermalcorrenthalpy: 0.361339 hartree
zpe.thermalcorrgfe: 0.294682 hartree
zpe.sumelectzpe: -768.119821 hartree
zpe.sumelectthermal: -768.102057 hartree
zpe.sumelectthermalent: -768.101113 hartree
zpe.sumelectthermalfe: -768.167770 hartree
dipole: 2.2711 2.4183 -2.4251
dipole: 4.1094
quadrupole: -101.2375 -102.8937 -101.8725
quadrupole: 0.2508 -0.8224 -1.0631
quadrupole: 0.7637 -0.8924 0.1287 0.2508 -0.8224 -1.0631
hfenergy: -768.4624518 hartree
pointgroup: C01 [X(C15H22N2O1)]
dipole: 0.4844924 1.2670552 -0.8796469 debye
polarizability: 203.5315191|-11.9605916|160.7184233|-10.9061059|0.9158071|162.2165301 unknown
InChI: InChI=1S/C15H22N2O/c1-2-3-12-18-14(13-8-5-4-6-9-13)15-16-10-7-11-17-15/h4-6,8-9,14,16H,2-3,7,10-12H2,1H3
charge 0 multiplicity 1
40 atoms
O  -1.001065 -0.990324 -0.142758
N  0.471773 2.321446 -1.027729
N  -0.737706 1.629974 0.944477
C  -0.043035 -0.071143 -0.737856
C  -0.142848 1.379178 -0.198003
C  0.516975 3.83753 0.914666
C  0.599374 3.73574 -0.625427
C  -0.711791 3.042107 1.419013
C  1.346696 -0.636274 -0.459654
C  -2.414511 -0.653906 -0.40614
C  -3.256025 -1.826349 0.105494
C  -4.771385 -1.596173 -0.100698
C  2.249557 -0.913173 -1.512735
C  1.740446 -0.879147 0.880275
C  -5.623123 -2.778451 0.409906
C  3.541586 -1.418459 -1.234514
C  3.02614 -1.389632 1.157829
C  3.932453 -1.656593 0.10246
H  -0.207318 -0.021087 -1.84248
H  0.455058 4.898096 1.219706
H  1.434587 3.406588 1.357236
H  -0.207143 4.34257 -1.086556
H  1.564043 4.133994 -0.991191
H  -0.731719 3.023866 2.523689
H  -1.646117 3.548221 1.095055
H  1.000359 1.989919 -1.835208
H  -2.565388 -0.509008 -1.501619
H  -2.668467 0.285541 0.121781
H  -3.040439 -1.969614 1.181906
H  -2.939971 -2.753587 -0.411151
H  -4.977571 -1.430993 -1.178483
H  -5.076663 -0.666768 0.421837
H  1.93798 -0.756194 -2.554022
H  1.027099 -0.668728 1.683873
H  -5.359567 -3.71328 -0.119783
H  -5.455341 -2.94774 1.490105
H  -6.703006 -2.59546 0.2588
H  4.233783 -1.634259 -2.056359
H  3.324906 -1.581726 2.194783
H  4.930882 -2.052402 0.321073
