program: Gaussian 09
title: 000118039
version: EM64L-G09RevD.01
frameworkgroup: C1[X(C16H23ClN2O)]
method: RPBEPBE
basis: SDD
operation: Freq
keyword: #p
keyword: freq=noraman
keyword: PBEPBE/SDD
title: #p freq=noraman PBEPBE/SDD
converged: YES YES NO NO
title: Mulliken charges:
elementType: Cl O N N C C C C C C C C C C C C C C C C H H H H H H H H H H H H H H H H H H H H H H H
charge: -0.078253 -0.329162 -0.378535 -0.060819 0.329549 -0.439128 -0.550458 -0.402057 -0.747329 0.123234 -0.736595 -0.248078 0.435119 -0.336123 -0.399413 -0.214032 -0.096007 -0.204719 -0.684575 -0.246548 0.224381 0.219242 0.219131 0.210611 0.201128 0.196930 0.211545 0.247479 0.207180 0.330289 0.225737 0.221238 0.218803 0.221267 0.279580 0.263361 0.199139 0.214550 0.230940 0.211664 0.226422 0.227743 0.255568
chargesum: 0.00000
title: Mulliken charges with hydrogens summed into heavy atoms:
elementType: Cl O N N C C C C C C C C C C C C C C C C
charge: -0.078253 -0.329162 -0.048246 -0.060819 0.329549 0.004495 -0.120715 -0.003999 -0.081125 0.123234 -0.070817 -0.026811 0.435119 -0.056542 -0.136052 0.199657 -0.096007 0.026222 -0.018747 0.009019
polarizability: 2.26297985e+02 1.07172573e+01 1.78170010e+02 -1.43967687e+01 1.48008123e+01 1.84047578e+02
1716.lowfreq: -9.8638 -3.7301 0.0016 0.0019 0.0020 7.4555 12.2139 27.1116 37.1712
frequency: 12.0614 27.0832 37.0904 44.6942 73.5247 75.1925 83.2008 104.1956 147.2947 160.3211 167.1783 178.3562 194.2436 203.6787 230.1868 240.0539 258.4858 269.0408 290.9776 306.9278 315.5883 333.7939 361.6324 385.5109 395.3320 423.3625 441.4368 504.2137 517.9706 527.9903 553.4582 582.9197 602.1957 648.7970 680.7417 685.6075 717.4255 769.8697 777.0010 813.6630 820.5421 855.4740 862.8080 872.0689 893.6947 906.6085 907.7800 925.4518 937.2279 948.3790 976.0523 985.4998 989.9020 1012.9958 1023.6940 1047.4216 1055.0667 1068.2901 1073.6055 1089.3151 1111.5008 1126.6654 1139.7850 1160.1549 1176.2312 1177.5820 1185.6140 1204.2857 1230.0022 1246.6364 1253.4462 1264.4938 1269.3511 1271.8960 1285.1958 1302.0861 1329.4952 1339.6029 1347.7924 1372.5432 1384.1539 1386.3770 1391.5935 1396.5061 1422.2782 1450.8336 1459.0827 1460.7641 1461.2199 1466.6689 1474.2607 1477.3691 1480.2005 1485.4394 1490.3246 1494.5974 1506.3250 1577.6962 1604.8592 1634.5543 2939.0210 2947.6292 2949.1051 2958.6189 2977.3278 2980.4672 2991.0178 2993.5771 3002.9861 3008.4593 3016.4506 3033.1988 3067.5042 3070.6028 3078.1572 3082.8729 3091.6001 3098.9000 3138.3823 3158.5373 3163.8532 3174.5422 3544.7538
redmass: 6.9678 3.5334 3.4451 3.5697 2.6736 2.7973 2.3465 2.7692 5.2786 2.8722 2.0693 4.5567 1.3195 3.4831 1.8130 1.3121 2.5314 2.2101 4.0462 5.5090 2.3143 3.7521 2.5584 10.0494 1.9266 3.4139 3.2444 4.3007 3.9451 3.3876 2.3393 1.7766 4.9887 5.9821 4.3055 3.3673 3.5754 1.2367 1.6048 1.1062 2.6851 2.9697 3.7117 3.0205 2.0551 1.4511 1.5023 1.4610 2.0614 2.4402 1.4117 4.9700 3.0410 1.7419 2.1353 1.9962 3.9567 2.0293 2.4081 1.6631 2.4453 2.8171 1.4474 1.6817 1.1515 1.9121 2.6363 1.9880 1.3904 1.6254 1.1568 1.2839 1.6020 1.4688 1.2852 1.3148 1.5249 1.4865 1.4177 1.7292 3.1229 1.2333 1.2006 1.3393 2.4147 1.0920 2.1099 1.1406 1.0934 1.1444 1.1118 1.0881 1.0471 1.0808 1.0557 1.0850 1.4461 6.6788 6.8274 6.8916 1.0667 1.0572 1.0647 1.0601 1.0363 1.0364 1.0840 1.0367 1.1053 1.0999 1.0965 1.0958 1.0993 1.0986 1.0997 1.0987 1.0990 1.1011 1.0870 1.0937 1.0917 1.0982 1.0777
irintensity: 0.9162 1.8115 0.0501 0.8512 0.5511 1.0971 2.6888 1.1561 2.1088 2.2580 0.3590 0.6251 0.4254 1.7051 2.0961 0.0167 2.3331 2.8288 4.9004 15.5272 0.4997 0.5345 2.4797 11.6551 0.5943 4.0605 2.4354 2.2883 4.2641 41.1024 31.1505 49.7651 4.8003 5.2298 22.3629 10.1011 27.7886 11.4884 43.3472 1.7558 4.9483 8.7517 15.3046 12.7897 6.7232 0.3053 0.6002 12.8343 0.6008 17.9845 0.3283 4.5341 39.4120 18.3015 4.0140 0.8753 154.4401 15.2824 6.2003 18.2556 0.8618 19.3394 5.5710 6.4786 1.9532 0.8846 34.2219 0.9381 1.6661 8.4739 4.1095 3.0332 6.5452 11.8019 37.0035 17.2092 3.6540 2.4283 18.4227 7.3407 4.1042 14.7962 32.8942 32.1550 28.7519 0.2426 42.9126 9.6538 18.2860 28.1129 5.5306 26.1055 5.4998 11.1219 3.1278 1.1635 91.9882 38.2864 31.6633 141.2457 37.6732 66.6113 32.9016 74.6789 17.8714 37.2292 24.2934 21.3871 32.7421 5.5034 48.5585 39.6823 19.6667 71.7814 43.6043 31.5944 32.9827 36.2767 8.0156 5.3804 0.1393 9.1280 59.8665
temp: 298.150 k
press: 1.00000 atm
elementType: 17 8 7 7 6 6 6 6 6 6 6 6 6 6 6 6 6 6 6 6 1 1 1 1 1 1 1 1 1 1 1 1 1 1 1 1 1 1 1 1 1 1 1
symmnumber: 1
zpe: 946014.1 jmol-1
zpe.correction: 0.360318 hartree
zpe.thermalcorrener: 0.381629 hartree
zpe.thermalcorrenthalpy: 0.382574 hartree
zpe.thermalcorrgfe: 0.307879 hartree
zpe.sumelectzpe: -1266.745993 hartree
zpe.sumelectthermal: -1266.724681 hartree
zpe.sumelectthermalent: -1266.723737 hartree
zpe.sumelectthermalfe: -1266.798432 hartree
dipole: 1.5164 1.5543 0.0205
dipole: 2.1716
quadrupole: -126.5887 -119.2537 -128.2572
quadrupole: -3.5805 10.7372 2.1863
quadrupole: -1.8888 5.4462 -3.5573 -3.5805 10.7372 2.1863
hfenergy: -1267.1063109 hartree
pointgroup: C01 [X(C16H23Cl1N2O1)]
dipole: 0.5125966 0.4936519 -0.4727625 debye
polarizability: 213.8965353|2.2788105|193.3838225|-29.4844028|9.1362683|181.2352148 unknown
InChI: InChI=1S/C16H23ClN2O/c1-4-16(3)10-18-15(19-11-16)14(20-5-2)12-7-6-8-13(17)9-12/h6-9,14,18H,4-5,10-11H2,1-3H3
charge 0 multiplicity 1
43 atoms
Cl -3.957715 0.328023 3.619302
O  -1.079634 1.749708 -0.698585
N  1.161113 0.764523 0.270041
N  0.882307 -1.262844 -1.008507
C  3.243214 -0.46036 -0.344529
C  2.536426 0.462218 0.694946
C  2.27255 -1.649386 -0.648389
C  4.551568 -1.039841 0.263109
C  3.517503 0.324491 -1.652524
C  0.453256 -0.118911 -0.524856
C  5.643269 -0.010409 0.634067
C  -0.995849 0.288987 -0.833865
C  -1.979892 -0.436632 0.095286
C  -2.4621 0.201943 1.26333
C  -2.377208 -1.764595 -0.19469
C  -2.262577 2.339031 -1.356291
C  -3.334951 -0.502845 2.110626
C  -3.253595 -2.449327 0.675332
C  -2.214923 3.847348 -1.119811
C  -3.747794 -1.821503 1.843595
H  2.534345 -0.040639 1.685798
H  3.092579 1.41096 0.806506
H  2.680714 -2.246707 -1.486254
H  2.236972 -2.326304 0.232721
H  4.973177 -1.766943 -0.461287
H  4.287802 -1.624748 1.169379
H  4.069693 -0.305969 -2.374606
H  2.571788 0.634652 -2.130553
H  4.117058 1.234395 -1.466072
H  0.741109 1.681556 0.430807
H  5.983973 0.561277 -0.247603
H  5.28697 0.712525 1.391253
H  6.526368 -0.522045 1.058919
H  -1.191953 -0.015418 -1.881633
H  -2.152673 1.226531 1.490296
H  -1.975564 -2.261908 -1.083647
H  -2.226548 2.100872 -2.440979
H  -3.186895 1.895322 -0.932318
H  -3.558255 -3.477176 0.450643
H  -3.075487 4.338022 -1.609654
H  -2.255134 4.074843 -0.040248
H  -1.285928 4.277439 -1.532455
H  -4.430582 -2.341554 2.521598
