program: Gaussian 09
title: 000117677
version: EM64L-G09RevD.01
frameworkgroup: C1[X(C7H14N2OS)]
method: RPBEPBE
basis: SDD
operation: Freq
keyword: #p
keyword: freq=noraman
keyword: PBEPBE/SDD
title: #p freq=noraman PBEPBE/SDD
converged: YES YES NO NO
title: Mulliken charges:
elementType: S O N N C C C C C C C H H H H H H H H H H H H H H
charge: -0.081756 -0.230969 -0.104157 -0.103816 -0.288955 -0.289288 -0.120778 -0.329713 -0.330313 -0.656347 -0.656691 0.239434 0.217074 0.217192 0.239407 0.199606 0.263876 0.263802 0.200474 0.251216 0.204044 0.220756 0.204352 0.250600 0.220949
chargesum: 0.00000
title: Mulliken charges with hydrogens summed into heavy atoms:
elementType: S O N N C C C C C C C
charge: -0.081756 -0.230969 -0.104157 -0.103816 0.167554 0.167310 -0.120778 0.133770 0.133963 0.019669 0.019210
polarizability: 1.30679994e+02 2.43441499e-02 1.20897072e+02 -5.17895312e-03 5.79566865e+00 7.61329155e+01
1716.lowfreq: -49.7210 -10.4685 -9.1164 -6.1420 0.0012 0.0021 0.0029 41.2810 49.6257
frequency: -49.6802 40.9367 49.3319 66.0137 121.6617 169.9906 213.5303 220.0074 307.0859 317.4912 346.0442 364.8046 375.2444 428.9907 470.5240 530.7105 568.3304 589.1484 645.1621 769.6540 774.6575 846.7052 899.7234 962.0114 980.8182 997.2605 997.9032 1046.7517 1072.6785 1075.2481 1085.5258 1099.7329 1116.6382 1168.2248 1214.7978 1240.3098 1256.6265 1275.8766 1285.7513 1312.2358 1343.4849 1358.1809 1360.7154 1383.9247 1385.0713 1409.9625 1436.4059 1457.3294 1460.9888 1469.7876 1470.4560 1479.4186 1479.6299 1487.2567 1490.3321 2907.2210 2915.5023 2983.2399 2983.5935 2988.7890 2990.4758 3062.9000 3063.4819 3076.1143 3080.2737 3082.9319 3083.4004 3097.6981 3097.9656
redmass: 2.3799 2.7958 2.4864 4.1927 5.9233 3.4124 1.0564 1.0731 5.1288 2.5070 2.5215 3.6859 3.4581 3.4206 2.7377 3.9799 5.1745 4.7442 6.8066 1.2255 1.1710 2.9978 4.1063 2.4230 2.4815 4.0226 3.6486 2.0291 2.6324 1.6978 2.0321 1.9820 2.1708 1.7208 1.3720 2.5393 1.8270 1.3314 1.5858 1.2270 1.6698 1.2413 1.2511 1.2104 1.2148 1.4536 1.3592 1.1759 1.1171 1.0514 1.0470 1.0590 1.0736 1.1042 1.5019 1.0694 1.0694 1.0359 1.0362 1.0644 1.0643 1.0982 1.0981 1.0927 1.0964 1.0989 1.0987 1.1015 1.1014
irintensity: 1.0861 0.0374 0.9008 4.3065 1.6851 0.0653 0.1263 0.4671 7.3059 2.9538 2.2620 14.0149 0.1628 4.2751 1.4480 6.9465 7.8249 16.0458 15.4780 11.7342 20.6128 0.8385 35.8122 4.8620 18.8697 9.1675 18.8560 0.1183 3.1223 40.1372 9.7582 14.0473 34.2161 8.8509 8.0685 43.2684 97.4799 4.3657 238.7531 17.1163 194.2694 6.3802 4.3326 12.4641 33.6804 35.6278 32.9345 62.7720 21.4356 2.1751 7.8814 22.2020 8.4987 2.4841 220.3411 31.3591 156.7886 25.2137 43.2027 74.7772 41.4725 0.2064 7.3533 30.5783 16.2560 29.2498 45.6191 27.2896 22.7380
temp: 298.150 k
press: 1.00000 atm
elementType: 16 8 7 7 6 6 6 6 6 6 6 1 1 1 1 1 1 1 1 1 1 1 1 1 1
symmnumber: 1
zpe: 551422.7 jmol-1
zpe.correction: 0.210026 hartree
zpe.thermalcorrener: 0.221600 hartree
zpe.thermalcorrenthalpy: 0.222544 hartree
zpe.thermalcorrgfe: 0.171414 hartree
zpe.sumelectzpe: -857.029627 hartree
zpe.sumelectthermal: -857.018053 hartree
zpe.sumelectthermalent: -857.017109 hartree
zpe.sumelectthermalfe: -857.068238 hartree
dipole: 0.0131 3.4930 2.1218
dipole: 4.0870
quadrupole: -61.3030 -83.8449 -77.1458
quadrupole: -0.0929 0.0088 1.4252
quadrupole: 12.7949 -9.7470 -3.0479 -0.0929 0.0088 1.4252
hfenergy: -857.2396527 hartree
pointgroup: C01 [X(C7H14N2O1S1)]
dipole: 0.0086898 -1.3282019 -0.9062553 debye
dipolederiv: -0.4637762 0.0021402 0.0004367 0.00327 -0.8575973 -0.1561126 0.0002866 -0.1203508 -0.329001 -0.7212696 -0.0012552 -0.0002903 -0.0002787 -0.6184603 -0.0671854 0.0003468 -0.0135596 -0.3965443 -1.2741182 -0.3114361 -0.1664275 -0.3178688 -0.960506 -0.1041162 -0.0729903 -0.0214119 -0.3473133 -1.2834787 0.3111958 0.1652348 0.3142823 -0.9537023 -0.1025274 0.0708327 -0.0207324 -0.3468654 0.476779 -0.1308865 0.0575871 -0.0241325 0.9032604 0.1165749 0.1206182 0.1445215 0.5858595 0.4750904 0.1274268 -0.0594693 0.0192148 0.9049506 0.1162131 -0.1235798 0.1434363 0.586255 1.6363233 -0.0010145 0.0003224 -0.0014201 1.4023035 0.3441888 0.0010055 0.1925728 0.0196842 0.6584948 -0.0590296 0.0699378 -0.2615299 0.1300893 -0.1058929 -0.0357141 -0.1369632 0.2440541 0.65505 0.0648683 -0.0655566 0.2714848 0.1290365 -0.1071921 0.0404749 -0.1376493 0.2446142 -0.0757987 0.0006063 -0.0374586 0.0337282 0.0583965 0.0676547 -0.0397238 0.1097662 -0.080024 -0.075162 -0.0032168 0.0371742 -0.0361581 0.0613108 0.0668341 0.0392089 0.108346 -0.0800056 -0.0852434 -0.1150051 0.0373255 -0.0557222 0.02373 -0.006338 0.0700718 0.0242358 0.0460825 0.0397139 0.0573577 0.0220949 -0.013691 -0.0734004 -0.0195602 -0.1033861 -0.1272525 -0.2087881 0.0402318 -0.0565831 -0.0222642 0.0145362 -0.0736635 -0.0193898 0.104583 -0.1255705 -0.2086336 -0.0868802 0.1137549 -0.0369096 0.0546815 0.0261284 -0.0066491 -0.0703561 0.023466 0.0461297 -0.0874837 -0.0564149 0.0415976 -0.1402442 -0.0548781 0.1370515 0.0258021 0.0889626 0.0158682 0.1372171 -0.0029394 -0.0630571 0.1257613 0.0149508 -0.0739225 -0.0162235 -0.0307284 0.0123268 0.1409562 0.0050107 0.0641249 -0.1243467 0.0132928 -0.0730668 0.017279 -0.0304817 0.0154555 -0.090456 0.0545665 -0.0443192 0.1372833 -0.0502478 0.1385996 -0.0292986 0.0901166 0.0124228 0.0562943 -0.0999496 0.080511 -0.0618378 0.0065707 0.0709155 0.0538536 0.0302502 0.042919 0.0984416 0.0073476 -0.0122804 -0.0404144 -0.076744 -0.1403179 -0.0384621 -0.0878621 -0.0342558 -0.1628586 0.0995988 0.0023483 0.1290269 0.0592465 -0.0035843 0.0083752 -0.0236325 0.0757666 0.0978573 -0.0044726 0.0145575 0.0435193 -0.0795745 -0.1390812 0.0401475 -0.0870752 -0.0309779 0.0546162 0.0993258 -0.0818152 0.0616691 0.0086138 0.0714044 -0.0537757 0.0322124 0.0391809 -0.1605406 -0.100996 -0.0034046 -0.1308131 0.0568936 -0.0045 -0.0093757 -0.0246161 0.07579 unknown
polarizability: 130.6799721|-0.0177566|120.1601005|0.0645095|8.1261246|76.8699094 unknown
InChI: InChI=1S/C7H14N2OS/c1-3-8-5-10-6-9(4-2)7(8)11/h3-6H2,1-2H3
charge 0 multiplicity 1
25 atoms
S  -0.013049 2.248175 0.641971
O  0.011933 -2.277391 0.360701
N  -1.182094 -0.187025 0.176581
N  1.18362 -0.17455 0.180117
C  -1.170659 -1.620091 -0.178278
C  1.187322 -1.606658 -0.177896
C  -0.003266 0.54339 0.30881
C  -2.51138 0.456947 0.288193
C  2.506262 0.481292 0.299439
C  -3.074831 0.918464 -1.072952
C  3.081601 0.931028 -1.060661
H  -2.039355 -2.117088 0.2819
H  -1.201071 -1.757607 -1.283602
H  1.218108 -1.741747 -1.283488
H  2.061723 -2.095189 0.280511
H  -3.194361 -0.269611 0.770302
H  -2.397231 1.326827 0.956195
H  2.376907 1.357992 0.955575
H  3.189718 -0.233488 0.798366
H  -2.396469 1.662868 -1.523849
H  -3.199647 0.075189 -1.776997
H  -4.062618 1.393858 -0.931823
H  3.221678 0.080508 -1.753055
H  2.402666 1.664212 -1.528811
H  4.063793 1.416194 -0.913949
