program: Gaussian 09
title: 000014984
version: EM64L-G09RevD.01
frameworkgroup: C1[X(C16H19N3O6S2)]
method: RPBEPBE
basis: SDD
operation: Freq
keyword: #p
keyword: freq=noraman
keyword: PBEPBE/SDD
title: #p freq=noraman PBEPBE/SDD
converged: YES YES NO NO
title: Mulliken charges:
elementType: S S O O O O O O N N N C C C C C C C C C C C C C C C C H H H H H H H H H H H H H H H H H H H
charge: 0.225334 1.178994 -0.165479 -0.401620 -0.188510 -0.262716 -0.467861 -0.453508 -0.118017 -0.364166 -0.745419 -0.446913 -0.162761 -0.106824 -0.162812 0.099053 -0.654272 -0.687747 0.264370 0.254751 -0.696371 0.481082 -0.375216 -0.430826 -0.214384 -0.217325 -0.241800 0.312702 0.287927 0.312534 0.239796 0.253881 0.230966 0.234662 0.227654 0.242566 0.322382 0.261089 0.215342 0.374069 0.369030 0.264003 0.226983 0.227990 0.227432 0.229955
chargesum: 0.00000
title: Mulliken charges with hydrogens summed into heavy atoms:
elementType: S S O O O O O O N N N C C C C C C C C C C C C C C C C
charge: 0.225334 1.178994 -0.165479 -0.401620 -0.188510 -0.262716 -0.467861 -0.453508 -0.118017 -0.041785 -0.002320 -0.134211 -0.162761 0.181103 0.149723 0.099053 0.070371 0.017135 0.264370 0.254751 -0.219940 0.481082 -0.111214 -0.203843 0.013605 0.010107 -0.011846
polarizability: 3.94935010e+02 1.74193810e+01 2.63975783e+02 1.57187819e+01 -3.80832353e-01 2.01715209e+02
1716.lowfreq: -6.1610 -2.3173 -0.0014 -0.0014 0.0012 6.8978 9.3855 16.4392 20.1052
frequency: 8.8678 16.3366 20.0415 22.0711 28.3279 30.7609 39.4946 52.0448 63.7191 82.9859 95.4623 103.1873 117.2820 131.1763 146.6807 172.2962 180.7951 188.3526 219.0411 227.6031 248.2415 254.9178 269.4272 280.2537 287.1370 298.3672 302.6597 307.5742 321.8931 344.3453 351.8711 357.1910 374.7453 394.9592 403.0490 411.1683 448.2166 462.2535 475.2638 487.2988 518.1002 532.3539 551.1591 569.7678 603.6626 619.9722 644.6742 690.2301 697.3723 708.9068 710.6479 729.5718 732.9247 758.9621 768.5875 823.0224 827.6266 838.0043 854.6162 860.9300 898.1368 911.5123 928.5873 935.9416 937.1223 941.3866 942.6551 971.1072 978.2300 989.6144 990.6865 998.2251 999.5916 1007.9403 1027.3387 1056.5548 1078.2515 1087.3504 1107.4612 1124.5164 1138.7188 1146.8189 1173.1035 1180.1641 1189.9541 1192.6315 1199.1822 1203.8617 1225.0283 1257.9976 1260.4865 1279.1606 1280.2085 1316.2781 1332.9124 1338.7966 1382.8108 1384.3642 1406.9735 1441.3181 1457.4418 1458.7732 1463.3909 1474.0438 1477.7633 1480.0991 1484.8191 1531.8591 1593.7767 1610.0011 1623.0102 1640.4264 1727.3765 2981.4054 2984.5930 3005.3049 3039.2585 3055.4191 3068.9877 3076.8801 3081.1403 3092.4158 3096.2661 3107.2946 3113.5616 3126.1904 3137.3444 3148.1712 3164.8163 3470.5222 3544.8275 3653.2981
redmass: 6.4448 5.1219 6.8122 7.6419 5.6696 6.5371 5.3160 5.2075 7.5375 12.3179 7.1173 8.2393 8.6431 7.0576 5.8026 4.9857 3.4837 2.7274 2.6410 5.3002 2.8333 1.3493 4.1750 3.5454 3.6017 1.1278 3.6586 4.4158 4.2352 3.9018 2.2786 2.9375 3.4996 5.0761 2.8297 3.9748 4.7951 3.2814 4.2962 9.5246 5.5965 5.2611 5.1709 1.2368 4.9244 5.7282 5.4401 7.2013 4.0394 2.2397 4.4126 3.2176 6.3444 2.5967 5.7595 4.0802 4.1252 5.2813 1.2480 10.2575 6.4631 1.6127 3.5908 2.6141 2.5733 2.0852 1.4980 6.4663 1.3968 5.3218 3.9107 1.3392 4.7483 1.3492 2.2393 2.8942 1.6214 2.0779 1.6940 1.7716 1.3978 1.5606 1.0553 2.0130 1.1423 1.9789 1.8751 1.9199 1.9385 1.7754 1.8303 1.8826 2.7170 1.5897 1.3043 1.2956 8.1156 1.1948 1.1930 2.1804 1.2108 1.0499 1.0465 1.7579 1.0502 1.0508 2.0306 1.0878 6.2330 6.0427 6.3774 10.8625 12.7552 1.0381 1.0371 1.0599 1.0849 1.0840 1.1022 1.0968 1.0975 1.0900 1.1008 1.1005 1.0879 1.0862 1.0914 1.0962 1.1016 1.0403 1.0782 1.1074
irintensity: 0.1258 3.1782 2.4871 1.1998 3.7071 1.2228 3.3599 2.7027 3.4690 0.1604 5.3897 4.5599 0.7941 4.1011 12.3413 0.3630 28.5427 22.3154 9.6009 3.0235 3.7607 5.1785 4.4801 3.3819 1.7513 0.1418 3.9646 56.0736 2.6645 0.3217 26.0655 36.4782 67.9457 219.6759 0.1300 7.2078 28.5772 1.2261 4.7847 230.4832 14.3396 52.5825 1.3001 76.3176 1.2042 1.4236 15.8320 7.5279 5.8681 33.4809 59.4424 25.2970 26.7565 33.1960 14.1369 5.5959 3.1255 14.0629 0.3908 151.0528 59.1655 1.1493 11.1530 6.6445 21.2607 0.6086 1.2650 13.2056 0.2146 0.6412 8.6210 0.2128 25.9862 2.7727 10.0808 74.5197 10.7902 59.5820 62.5741 40.1887 19.5874 12.8223 0.2508 5.8932 4.1341 24.1830 19.6766 5.6109 27.5845 8.6671 165.4142 43.5998 225.0820 23.5145 7.4684 23.7707 0.5600 26.4301 18.3108 5.7460 97.7574 1.4355 6.7320 318.0745 14.9472 18.8187 35.8956 35.2805 8.9980 38.8680 128.0077 165.4049 420.9351 10.2447 22.2892 20.2655 2.3732 35.3339 7.3543 4.3238 24.7450 14.1636 13.3112 17.1498 10.9689 0.1424 13.7987 28.1520 24.5583 128.0193 17.1552 63.4267
temp: 298.150 k
press: 1.00000 atm
elementType: 16 16 8 8 8 8 8 8 7 7 7 6 6 6 6 6 6 6 6 6 6 6 6 6 6 6 6 1 1 1 1 1 1 1 1 1 1 1 1 1 1 1 1 1 1 1
symmnumber: 1
zpe: 886922.8 jmol-1
zpe.correction: 0.337811 hartree
zpe.thermalcorrener: 0.366387 hartree
zpe.thermalcorrenthalpy: 0.367331 hartree
zpe.thermalcorrgfe: 0.272772 hartree
zpe.sumelectzpe: -2030.622501 hartree
zpe.sumelectthermal: -2030.593926 hartree
zpe.sumelectthermalent: -2030.592982 hartree
zpe.sumelectthermalfe: -2030.687540 hartree
dipole: -3.3167 0.8471 1.8965
dipole: 3.9134
quadrupole: -150.9529 -184.4992 -168.6721
quadrupole: -22.5064 -33.0650 -3.7505
quadrupole: 17.0885 -16.4578 -0.6307 -22.5064 -33.0650 -3.7505
hfenergy: -2030.9603125 hartree
pointgroup: C01 [X(C16H19N3O6S2)]
dipole: -1.2985817 0.5095133 0.6516413 debye
polarizability: 394.4415213|23.4945595|259.4074189|5.3538086|-18.0669658|206.7770618 unknown
InChI: InChI=1S/C16H19N3O6S2/c1-16(2)12(15(22)25-27(17,23)24)19-13(21)11(14(19)26-16)18-10(20)8-9-6-4-3-5-7-9/h3-7,11-12,14,18H,8,17H2,1-2H3
charge 0 multiplicity 1
46 atoms
S  -1.151587 3.019391 -0.687001
S  -5.857664 -1.71472 0.500558
O  0.371114 -0.275594 1.981184
O  -4.397448 -0.394428 0.905682
O  -3.080504 -1.257121 -0.829447
O  3.539207 2.307062 -0.772859
O  -6.569303 -1.205857 -0.845976
O  -5.344768 -3.208094 0.779327
N  -0.962627 0.474672 0.091086
N  2.155623 0.437603 -0.787068
N  -6.883905 -1.263809 1.841572
C  -0.290277 1.340859 -0.909926
C  -2.810412 2.083324 -0.260842
C  -2.340779 0.74065 0.4720
C  1.064066 1.117433 -0.128918
C  0.197351 0.29301 0.891352
C  -3.563995 1.81926 -1.582868
C  -3.632795 2.962446 0.697377
C  -3.278909 -0.437538 0.083963
C  3.36377 1.084244 -1.048238
C  4.46034 0.200546 -1.656358
C  5.331708 -0.449069 -0.57821
C  6.010531 0.354991 0.373789
C  5.476643 -1.857109 -0.517835
C  6.817931 -0.242202 1.365954
C  6.287517 -2.455447 0.474614
C  6.96032 -1.649109 1.419925
H  -0.330687 1.003594 -1.955151
H  -2.39784 0.877247 1.56663
H  1.452606 2.055272 0.304757
H  -3.76489 2.778544 -2.087768
H  -2.981438 1.183864 -2.271237
H  -4.534816 1.320761 -1.395704
H  -3.946592 3.896558 0.199449
H  -4.544804 2.418451 1.007371
H  -3.055845 3.226433 1.600492
H  2.074616 -0.562863 -0.979217
H  5.073002 0.862925 -2.29326
H  4.020608 -0.578927 -2.305556
H  -6.585891 -1.609294 2.758297
H  -7.336266 -0.348699 1.765954
H  5.894469 1.444495 0.336938
H  4.961671 -2.489669 -1.252217
H  7.335568 0.388704 2.09724
H  6.391645 -3.545751 0.508821
H  7.587637 -2.11074 2.190522
