program: Gaussian 09
title: 000114018
version: EM64L-G09RevD.01
frameworkgroup: C1[X(C18H20N4O2)]
method: RPBEPBE
basis: SDD
operation: Freq
keyword: #p
keyword: freq=noraman
keyword: PBEPBE/SDD
title: #p freq=noraman PBEPBE/SDD
converged: YES YES NO NO
title: Mulliken charges:
elementType: O O N N N N C C C C C C C C C C C C C C C C C C H H H H H H H H H H H H H H H H H H H H
charge: -0.269515 -0.271235 -0.083079 -0.247203 -0.056345 0.022021 -0.417101 -0.331171 -0.274880 -0.079458 0.120974 0.192792 0.364011 0.172547 -0.622314 -0.615821 -0.067442 -0.361561 -0.358310 -0.362333 -0.245808 -0.245253 -0.311057 -0.243796 0.217920 0.214636 0.216708 0.198760 0.238862 0.219957 0.226045 0.189918 0.221074 0.221167 0.190588 0.224693 0.296204 0.268342 0.249580 0.268474 0.225989 0.223607 0.250949 0.227862
chargesum: 0.00000
title: Mulliken charges with hydrogens summed into heavy atoms:
elementType: O O N N N N C C C C C C C C C C C C C C C C C C
charge: -0.269515 -0.271235 -0.083079 -0.247203 -0.056345 0.022021 0.015454 0.084297 0.183939 -0.079458 0.120974 0.192792 0.364011 0.172547 0.014724 0.020627 0.228763 -0.093219 -0.108730 -0.093859 -0.019819 -0.021646 -0.060108 -0.015933
polarizability: 3.57363344e+02 -5.94586048e+01 2.84562726e+02 2.39459430e+01 1.32192843e+01 1.35042828e+02
1716.lowfreq: -3.8191 -3.0212 -0.9675 -0.0005 -0.0004 0.0006 14.7204 21.4527 25.1706
frequency: 14.4868 21.3934 25.0139 38.2042 53.4331 75.9021 80.9138 103.4380 106.2471 129.2146 164.5381 181.7150 197.6762 219.2755 230.5932 251.4220 259.4947 278.9839 279.5821 313.8589 342.1781 368.5663 383.2584 385.6974 401.3007 413.3437 440.2623 459.3685 502.7453 511.7062 535.7708 564.5333 582.4423 615.7402 645.6532 661.9651 670.1506 692.9752 709.3299 720.0544 755.9019 766.6496 778.2668 804.2804 819.4719 827.3253 844.3445 863.3574 875.5127 899.3142 909.3076 922.8701 954.1610 973.5169 989.3937 993.2757 998.9798 1006.1293 1018.8875 1030.0247 1037.3858 1039.5611 1072.8722 1076.3733 1088.9912 1091.1243 1105.5483 1140.1398 1148.3463 1166.5720 1171.2450 1174.9182 1204.7979 1218.9985 1225.6598 1236.7574 1261.1265 1267.3061 1297.1290 1302.2003 1304.2511 1326.6326 1328.9700 1341.0050 1373.8465 1383.6158 1390.3700 1399.9990 1418.4250 1422.0842 1442.3439 1445.2596 1451.8214 1461.4736 1467.8422 1470.9074 1476.5647 1480.2618 1482.8531 1487.4780 1493.4024 1509.8241 1578.2097 1579.1922 1608.9701 1623.5443 2844.4148 2858.3188 2880.3540 2997.5508 3005.4178 3008.3911 3019.0100 3029.7871 3059.1074 3077.0230 3081.8577 3086.2935 3123.7256 3136.7322 3155.7414 3161.9949 3176.8251 3182.6613 3187.3085 3198.3403
redmass: 4.3148 2.7618 3.8663 6.4703 4.0714 3.7527 3.9461 3.0650 5.1079 3.6620 8.2964 4.6162 2.9347 1.2954 1.7815 1.2057 5.0283 4.4476 6.0095 4.6874 2.6502 4.7299 5.4943 3.3274 2.8920 2.6660 3.7015 3.8511 4.5346 3.9537 6.9589 5.5490 6.6203 6.3714 7.2026 8.7272 7.6183 1.7972 3.9419 5.1835 3.2297 1.9949 2.8681 3.8748 3.3101 1.3327 1.2601 3.2940 7.4703 1.8605 1.4398 1.4437 1.3374 1.4003 5.5022 1.3701 3.1668 3.2557 2.8043 1.7155 1.9061 2.1747 6.9935 1.8061 1.7843 1.4016 1.9781 1.5824 3.5751 1.4974 1.8822 1.1679 1.1285 1.6778 1.6447 1.7339 2.5264 4.7400 2.6981 1.6252 1.4853 1.3751 1.4733 1.4603 4.7289 1.4827 3.4043 2.0643 1.1457 3.2361 1.1839 2.8414 1.0847 1.0504 1.0613 1.1489 1.0503 1.0817 2.6043 1.0634 8.6002 4.8987 5.7236 5.8859 6.0843 10.9388 1.0575 1.0581 1.0671 1.0603 1.0841 1.0642 1.0727 1.0716 1.1007 1.1012 1.1067 1.1004 1.0851 1.0904 1.0973 1.0921 1.0887 1.0936 1.0958 1.1000
irintensity: 0.1527 0.3995 0.1416 0.4910 0.1569 2.9489 1.4977 0.1401 0.4481 1.0033 5.5073 1.1195 1.7315 1.4171 0.9241 1.2624 0.2409 0.1931 0.9762 2.8897 8.2984 2.6828 3.4941 2.5474 0.0230 1.5720 4.2087 1.1785 16.0093 16.6186 5.9373 10.0498 13.9273 0.6441 5.7622 3.2210 3.7783 51.1885 2.1512 2.4715 8.9995 6.4205 39.4646 7.8993 18.1752 50.6301 1.4758 13.7088 19.8495 2.0304 4.1479 3.8038 0.4897 1.2512 0.9745 0.3474 6.6426 20.4826 70.4706 33.4880 44.3538 13.1818 0.9128 1.2773 13.8215 9.4277 25.0873 1.4981 141.4638 11.5489 32.7705 15.3389 8.1466 52.7301 28.1606 6.2355 11.1893 97.6643 64.7603 36.1676 67.1334 1.1297 18.7705 72.9847 2.2463 1.4032 41.9323 45.0710 2.4734 46.8849 1.5014 12.7199 6.7584 18.9753 11.6669 34.7759 19.3602 15.5435 24.7112 24.3844 49.8863 187.0425 4.5652 21.6510 37.1867 331.6273 71.0211 106.5951 127.5388 12.8187 30.2292 14.1006 49.0794 54.4236 34.7030 27.2832 30.3411 55.9180 0.6281 20.3947 44.9725 3.5133 10.2014 11.2717 6.8269 6.9219
temp: 298.150 k
press: 1.00000 atm
elementType: 8 8 7 7 7 7 6 6 6 6 6 6 6 6 6 6 6 6 6 6 6 6 6 6 1 1 1 1 1 1 1 1 1 1 1 1 1 1 1 1 1 1 1 1
symmnumber: 1
zpe: 921187.1 jmol-1
zpe.correction: 0.350862 hartree
zpe.thermalcorrener: 0.372886 hartree
zpe.thermalcorrenthalpy: 0.373831 hartree
zpe.thermalcorrgfe: 0.296760 hartree
zpe.sumelectzpe: -1065.599164 hartree
zpe.sumelectthermal: -1065.577139 hartree
zpe.sumelectthermalent: -1065.576195 hartree
zpe.sumelectthermalfe: -1065.653265 hartree
dipole: -1.3814 -1.1492 0.1986
dipole: 1.8079
quadrupole: -134.0226 -147.1013 -139.2388
quadrupole: -3.1064 2.5569 2.3348
quadrupole: 6.0984 -6.9804 0.8821 -3.1064 2.5569 2.3348
hfenergy: -1065.9500253 hartree
pointgroup: C01 [X(C18H20N4O2)]
dipole: -0.4984751 0.5001331 -0.0854886 debye
polarizability: 363.3336414|47.407062|273.9862854|-46.9234145|-1.9886397|139.6489711 unknown
InChI: InChI=1S/C18H20N4O2/c1-21(2)10-6-12-24-17-16(14-7-4-3-5-8-14)18(23)22-11-9-19-13-15(22)20-17/h3-5,7-9,11,13H,6,10,12H2,1-2H3
charge 0 multiplicity 1
44 atoms
O  -0.758966 0.997624 0.295173
O  2.580297 -2.466963 -0.272994
N  -4.905101 2.217362 -0.19543
N  3.120375 -0.18581 -0.390593
N  1.470627 1.544873 -0.131151
N  5.075502 1.819769 -0.784518
C  -2.532743 2.627625 0.543387
C  -3.471712 1.946057 -0.473601
C  -1.052861 2.462299 0.19991
C  0.778213 -0.835791 0.062687
C  0.532287 0.570975 0.075875
C  2.134159 -1.283349 -0.199656
C  -0.286401 -1.852442 0.28398
C  2.740617 1.170538 -0.354045
C  -5.390733 1.543494 1.027611
C  -5.756744 1.891822 -1.360006
C  4.451086 -0.532752 -0.614566
C  -0.250036 -3.099713 -0.406653
C  -1.361465 -1.622615 1.191886
C  3.792274 2.136366 -0.569019
C  -1.259357 -4.065003 -0.212071
C  -2.361115 -2.596214 1.393577
C  5.395563 0.461889 -0.801471
C  -2.320618 -3.822092 0.689768
H  -2.76513 3.710109 0.566479
H  -2.703887 2.236475 1.563489
H  -3.253782 0.849231 -0.502844
H  -3.247052 2.348784 -1.481111
H  -0.395644 3.000863 0.904426
H  -0.814242 2.797612 -0.826468
H  -4.829863 1.892353 1.911119
H  -5.300545 0.427324 0.976719
H  -6.454413 1.795023 1.186905
H  -6.802832 2.174961 -1.144688
H  -5.742807 0.805516 -1.632732
H  -5.421344 2.469268 -2.240023
H  4.648293 -1.606924 -0.625078
H  0.576355 -3.313507 -1.087918
H  -1.411359 -0.679828 1.740695
H  3.509963 3.193207 -0.550238
H  -1.211668 -5.011815 -0.761519
H  -3.17094 -2.398186 2.105039
H  6.44415 0.211424 -0.974564
H  -3.1001 -4.576639 0.845034
