program: Gaussian 09
title: 000119579
version: EM64L-G09RevD.01
frameworkgroup: C1[X(C8H10O10)]
method: RPBEPBE
basis: SDD
operation: Freq
keyword: #pfreq=noraman
keyword: PBEPBE/SDD
title: #p freq=noraman PBEPBE/SDD
converged: YES YES NO NO
title: Mulliken charges:
elementType: O O O O O O O O O O C C C C C C C C H H H H H H H H H H
charge: -0.284457 -0.426954 -0.414742 -0.437733 -0.427025 -0.218395 -0.182722 -0.419944 -0.202926 -0.213316 -0.071506 -0.085886 -0.192002 -0.529744 0.199369 0.159509 0.171364 0.213973 0.283628 0.304168 0.285343 0.291202 0.263298 0.376340 0.391502 0.392529 0.393772 0.381358
chargesum: 0.00000
title: Mulliken charges with hydrogens summed into heavy atoms:
elementType: O O O O O O O O O O C C C C C C C C
charge: -0.284457 -0.050614 -0.023240 -0.045205 -0.033253 -0.218395 -0.182722 -0.038586 -0.202926 -0.213316 0.212122 0.218282 0.093341 0.024756 0.199369 0.159509 0.171364 0.213973
polarizability: 1.17577624e+02 4.36598727e+00 1.17173411e+02 -9.65240001e+00 -3.78830293e+00 1.10969017e+02
1716.lowfreq: -13.4091 -5.3206 -1.0773 0.0006 0.0006 0.0008 16.5968 26.7143 37.1552
frequency: 15.9707 26.6018 37.0624 44.3396 59.2959 67.5564 72.6934 74.6754 94.5646 122.8867 130.4980 178.4476 206.1014 218.6163 231.6622 277.1340 300.5130 353.3717 366.0989 409.9561 435.3297 457.9059 483.4006 498.8008 505.8314 516.8318 539.6531 576.9500 595.0427 609.4976 623.3517 627.2114 663.3515 675.1076 733.0249 768.0911 791.2197 831.9427 848.9638 874.3254 932.1472 960.5216 982.3782 1012.3189 1031.8901 1041.6971 1055.9925 1071.4306 1094.6980 1112.6974 1198.8992 1213.6258 1242.1915 1249.3950 1256.1599 1267.0812 1280.4795 1302.7787 1311.2977 1317.9182 1344.5763 1376.6616 1387.1761 1449.4036 1665.7242 1672.2477 1675.3789 1699.9701 2990.8268 3000.8472 3037.7917 3074.9022 3105.8981 3516.1194 3519.9166 3520.9870 3528.9267 3535.8088
redmass: 10.2304 7.0205 6.5814 8.5136 9.1515 10.2445 10.4528 7.9632 8.0738 6.8773 8.5830 6.1808 3.7190 6.0082 3.1519 6.1234 6.5381 2.0531 4.1238 4.0864 2.9829 5.4268 3.7701 2.7041 3.0709 2.5796 2.4520 2.4737 1.7840 2.9479 1.8342 1.7156 2.1829 4.0633 5.0112 5.1733 3.6947 4.6938 5.4249 4.1360 4.3110 3.0362 3.1960 3.4929 2.8992 2.7376 2.9613 2.9534 2.1737 3.4303 1.1822 1.2718 1.3904 1.4059 1.4797 1.4558 1.5351 1.8167 1.6279 1.9820 1.5265 1.6439 1.2899 1.0971 9.6589 8.9823 9.5575 9.8624 1.0820 1.0818 1.0612 1.0847 1.1020 1.0642 1.0640 1.0644 1.0653 1.0644
irintensity: 2.2814 1.5847 1.8485 0.3654 1.2629 1.3179 0.1843 1.0700 1.8466 1.2777 1.0674 6.1105 6.1657 5.5835 37.4839 8.3163 11.7179 90.8675 1.2466 5.2183 5.2660 25.6834 44.3549 10.6152 60.1124 83.7871 82.5155 6.6999 28.7169 137.3650 152.8511 180.3868 89.9095 46.8644 6.3632 6.4394 1.3460 36.8388 0.4865 6.3842 11.5604 27.1191 23.5177 66.1350 609.1649 309.1999 95.5518 36.1372 98.5947 46.9253 6.5233 32.0066 6.0328 1.5667 11.6123 27.1539 3.4535 38.3863 31.0500 17.0773 7.7016 48.7561 19.0305 26.6277 204.5528 182.5771 137.5966 295.1176 10.8293 21.0586 3.5806 6.7153 5.1109 31.9371 31.5476 39.7214 26.9022 40.6983
temp: 298.150 k
press: 1.00000 atm
elementType: 8 8 8 8 8 8 8 8 8 8 6 6 6 6 6 6 6 6 1 1 1 1 1 1 1 1 1 1
symmnumber: 1
zpe: 502327.7 jmol-1
zpe.correction: 0.191327 hartree
zpe.thermalcorrener: 0.210654 hartree
zpe.thermalcorrenthalpy: 0.211598 hartree
zpe.thermalcorrgfe: 0.140161 hartree
zpe.sumelectzpe: -1061.697201 hartree
zpe.sumelectthermal: -1061.677874 hartree
zpe.sumelectthermalent: -1061.676929 hartree
zpe.sumelectthermalfe: -1061.748367 hartree
dipole: 1.0906 -1.4385 4.7472
dipole: 5.0789
quadrupole: -98.4090 -98.3521 -102.9638
quadrupole: 0.0600 -7.2450 6.2557
quadrupole: 1.4993 1.5562 -3.0555 0.0600 -7.2450 6.2557
hfenergy: -1061.8885279 hartree
pointgroup: C01 [X(C8H10O10)]
dipole: -0.6010328 0.2157363 -1.8933998 debye
polarizability: 115.8361564|0.8929133|113.279774|-11.1791479|3.3917314|116.6041209 unknown
InChI: InChI=1S/C8H10O10/c9-3(10)1-2(6(12)13)18-5(8(16)17)4(11)7(14)15/h2,4-5,9,11-12,14,16H,1H2
charge 0 multiplicity 1
28 atoms
O  0.092521 -0.389187 0.390018
O  2.976601 -0.043661 0.99554
O  2.728732 -0.888639 -2.148906
O  -3.193082 -1.844449 0.87914
O  0.702879 2.73113 0.156869
O  1.418963 -2.479963 -1.068004
O  -1.771686 -0.717952 2.340922
O  -1.501239 1.607809 -2.228837
O  1.525571 1.98117 2.202251
O  -2.736614 1.463639 -0.262983
C  1.083799 -0.054827 -0.621575
C  -1.090554 -1.148521 -0.021554
C  2.152234 0.781209 0.141361
C  -1.795919 -0.584532 -1.284781
C  1.733317 -1.288295 -1.258912
C  -2.007908 -1.163511 1.208498
C  1.447246 1.870693 0.965297
C  -2.084243 0.901875 -1.165999
H  0.655617 0.573449 -1.429117
H  -0.79996 -2.196462 -0.23629
H  2.825395 1.242185 -0.599776
H  -2.754979 -1.121923 -1.389081
H  -1.193783 -0.776178 -2.18659
H  2.516641 -0.151894 1.869901
H  3.175989 -1.685174 -2.543732
H  -3.789444 -1.869163 1.674614
H  0.212961 3.379494 0.732074
H  -1.669555 2.582879 -2.118548
