program: Gaussian 09
title: 000122569
version: EM64L-G09RevD.01
frameworkgroup: C1[X(C9H11N)]
method: RPBEPBE
basis: SDD
operation: Freq
keyword: #pfreq=noraman
keyword: PBEPBE/SDD
title: #p freq=noraman PBEPBE/SDD
converged: YES YES NO NO
title: Mulliken charges:
elementType: N C C C C C C C C C H H H H H H H H H H H
charge: -0.698690 -0.446808 -0.543093 -0.549573 0.128225 0.335494 0.291265 -0.477869 -0.426839 -0.199309 0.221945 0.214304 0.223730 0.209410 0.222131 0.221407 0.236133 0.209744 0.214463 0.301527 0.312402
chargesum: 0.00000
title: Mulliken charges with hydrogens summed into heavy atoms:
elementType: N C C C C C C C C C
charge: -0.084761 -0.010559 -0.109952 -0.106035 0.128225 0.335494 0.291265 -0.241735 -0.217095 0.015154
polarizability: 1.22452192e+02 1.98485150e+00 1.19947546e+02 1.89981475e+00 -5.82705371e-01 5.53986720e+01
1716.lowfreq: -10.7932 -0.0008 -0.0006 -0.0006 4.1724 13.6131 137.6047 153.0389 225.1104
frequency: 137.5887 153.0361 225.1088 252.5228 262.6974 311.5740 382.7517 446.5328 486.5523 494.2005 547.6287 555.3573 604.4148 676.7328 708.5993 770.4982 810.0249 845.9206 859.0981 889.4343 914.4001 952.5849 962.6252 1018.7981 1036.4659 1043.9052 1090.0830 1126.8025 1162.8566 1180.6563 1189.5520 1212.0555 1243.6144 1282.7317 1290.3666 1312.7791 1332.3307 1405.8213 1453.4878 1461.4679 1468.4986 1477.8394 1488.0329 1607.1666 1617.1583 1638.9193 2949.2879 2969.3422 2995.9347 3011.1478 3041.7676 3073.2414 3111.0567 3129.5267 3151.3097 3571.2362 3712.8673
redmass: 2.3296 2.4448 2.4670 2.5586 3.2479 1.2326 1.0544 3.2263 3.2452 4.7194 3.0390 4.4509 4.0447 2.4158 2.3368 1.5154 4.2632 2.0103 1.4822 1.5196 2.4844 1.3147 2.2710 2.4412 2.3646 1.6723 1.5279 1.2118 1.2934 1.4987 1.8274 1.3055 1.4619 1.7858 1.3921 1.4845 2.3533 7.5742 1.6524 1.1301 1.6014 1.1610 2.7077 7.6076 3.6097 1.3788 1.0624 1.0656 1.0805 1.0806 1.0942 1.1044 1.0859 1.0910 1.0988 1.0447 1.1039
irintensity: 0.0744 3.0430 0.1792 13.4854 1.3780 291.6262 1.4869 1.1719 0.2006 2.7620 1.1356 1.1458 0.9033 0.1969 10.8699 74.3071 1.6906 6.9939 0.1955 0.4772 2.6937 1.5500 5.9284 1.3535 13.9668 1.4116 10.7793 0.4219 3.7008 1.0336 0.8780 2.5773 0.3041 0.2848 0.2376 2.5413 38.4775 6.0442 7.2234 2.3874 24.4216 9.9994 56.8597 10.9077 37.6776 251.3502 48.3583 41.0587 15.0913 59.8583 38.4621 58.0976 10.2920 26.0752 30.8670 47.2814 18.8924
temp: 298.150 k
press: 1.00000 atm
elementType: 7 6 6 6 6 6 6 6 6 6 1 1 1 1 1 1 1 1 1 1 1
symmnumber: 1
zpe: 467189.5 jmol-1
zpe.correction: 0.177943 hartree
zpe.thermalcorrener: 0.186587 hartree
zpe.thermalcorrenthalpy: 0.187531 hartree
zpe.thermalcorrgfe: 0.145048 hartree
zpe.sumelectzpe: -403.590042 hartree
zpe.sumelectthermal: -403.581398 hartree
zpe.sumelectthermalent: -403.580454 hartree
zpe.sumelectthermalfe: -403.622937 hartree
dipole: -0.1090 -2.0743 0.0913
dipole: 2.0792
quadrupole: -52.1071 -51.3148 -64.0411
quadrupole: 3.3919 0.5191 -0.2439
quadrupole: 3.7139 4.5062 -8.2200 3.3919 0.5191 -0.2439
hfenergy: -403.7679851 hartree
pointgroup: C01 [X(C9H11N1)]
dipole: 0.0125746 0.8170296 0.0379194 debye
dipolederiv: -0.2737967 -0.361451 -0.0300175 -0.4618491 -1.2927458 0.0074026 -0.0333753 -0.0026278 -0.7329429 0.1246623 -0.0273283 -0.055983 -0.0301014 0.0082024 0.0240814 0.0186741 0.0008106 0.1528093 0.0071261 -0.0177017 -0.0281152 -0.0089782 0.0490184 -0.0280304 -0.0019242 -0.0306844 0.2002098 -0.0262567 0.0497035 0.0047853 -0.007838 0.0581721 0.0317191 0.0474072 0.0282174 0.1675788 -0.1470219 -0.4591248 -0.0058533 -0.1794913 -0.2427813 -0.0017069 -0.0497873 0.0377507 -0.1313945 0.2748231 0.0443083 -0.0182716 0.0027967 0.2078196 0.0123748 -0.0869539 -0.0078218 -0.0332398 0.1735258 0.4562665 0.0047827 0.5483252 1.3257658 0.010884 0.0197775 0.0126184 0.1365369 -0.3528896 0.053846 0.0004333 0.0438208 -0.1001034 -0.005191 0.0116993 0.004215 -0.2457662 0.0367123 0.1910408 -0.0096432 -0.212756 -0.3685207 0.003014 -0.0147157 -0.0155657 -0.2513173 0.2015798 0.0111023 -0.0134727 0.1553499 0.1492464 0.0016771 -0.0054442 0.0115094 -0.1331464 0.0736848 -0.0087118 -0.014678 -0.0092738 0.0447083 0.0042479 -0.0918755 0.0252715 -0.1700806 -0.1880338 0.072174 0.0693334 0.0806286 0.0430101 -0.0231063 0.1147378 -0.0312334 0.0456534 -0.0122962 0.0447549 0.0146024 0.0468802 0.0019388 -0.0815871 0.0469618 -0.1325438 -0.1287362 0.0290723 -0.0324386 0.0226358 0.0235826 -0.1356347 0.1016946 -0.0213478 0.1354386 -0.0005946 -0.0102296 -0.0541444 -0.0412838 -0.0848539 -0.0749699 -0.0841492 -0.0989857 -0.1068749 0.0190212 -0.0357422 -0.0216966 0.0554583 0.0138462 0.0485981 0.0450962 0.1031518 0.0859867 -0.1269038 0.0568253 -0.0738353 0.0028658 -0.0431093 -0.1115137 -0.0006864 -0.0022142 -0.0035959 0.1717732 -0.1521185 -0.0526166 0.0107662 -0.079 0.0473667 0.0018949 0.0104949 -0.0005283 0.1690758 -0.0412306 0.1271015 0.0089692 0.123588 -0.0369397 -0.0079646 0.0103085 -0.0102626 0.1501364 0.12334 0.0315361 0.0107724 0.0336591 0.1856362 -0.0063214 0.0091893 -0.0028415 0.3770695 0.1382641 0.0272153 0.0119132 0.0447737 0.1937266 -0.0053434 0.0142217 0.0027618 0.3642582 unknown
polarizability: 122.3182836|2.0733199|120.0944498|-1.6156462|0.6754515|55.3856768 unknown
InChI: InChI=1S/C9H11N/c10-9-6-2-4-7-3-1-5-8(7)9/h2,4,6H,1,3,5,10H2
charge 0 multiplicity 1
21 atoms
N  1.597086 2.177233 0.026619
C  -2.583487 0.495899 -0.275092
C  -1.393508 1.432574 0.108114
C  -2.121624 -0.938227 0.130848
C  -0.19157 0.49734 0.043711
C  -0.60089 -0.855898 0.044433
C  1.1863 0.839607 0.010748
C  0.33998 -1.906377 0.002228
C  2.138764 -0.221622 -0.042003
C  1.715287 -1.567558 -0.046734
H  -2.731365 0.53236 -1.37062
H  -3.532088 0.79356 0.205468
H  -1.524324 1.83906 1.133895
H  -1.31683 2.300934 -0.57624
H  -2.55192 -1.723461 -0.517006
H  -2.431638 -1.170751 1.170568
H  0.021186 -2.954285 -0.000096
H  3.209931 0.014512 -0.080084
H  2.470459 -2.361515 -0.09036
H  2.583225 2.416721 -0.00629
H  0.917625 2.929494 0.074092
