program: Gaussian 09
title: 000014937
version: EM64L-G09RevD.01
frameworkgroup: C1[X(H4O8Si3)]
method: RPBEPBE
basis: SDD
operation: Freq
keyword: #pfreq=noraman
keyword: PBEPBE/SDD
title: #p freq=noraman PBEPBE/SDD
converged: YES YES NO NO
title: Mulliken charges:
elementType: Si Si Si O O O O O O O O H H H H
charge: 1.549312 1.509277 1.508930 -0.810757 -0.804324 -0.804555 -0.811045 -0.752751 -0.740560 -0.752576 -0.740539 0.410796 0.414071 0.410696 0.414026
chargesum: 0.00000
title: Mulliken charges with hydrogens summed into heavy atoms:
elementType: Si Si Si O O O O O O O O
charge: 1.549312 1.509277 1.508930 -0.810757 -0.804324 -0.804555 -0.811045 -0.341955 -0.326489 -0.341880 -0.326513
polarizability: 1.21565806e+02 -4.98536188e-01 6.43271599e+01 -9.05216679e-04 -7.98240917e-03 6.31885656e+01
1716.lowfreq: -1.1930 -0.0008 -0.0006 0.0009 0.3549 12.6366 59.2520 59.8230 66.3644
frequency: 59.2476 59.8201 66.3628 109.9428 165.1464 192.6129 200.7695 203.2681 252.8855 278.0841 278.9652 282.6547 283.7176 332.6076 336.5377 347.1413 375.7083 376.5418 521.6105 604.5344 604.8452 634.5877 659.7711 682.7006 688.8169 691.9542 719.1077 742.5190 743.6290 744.3266 892.0312 944.0519 951.0878 993.3454 994.8454 3730.6431 3731.3297 3739.4757 3739.8107
redmass: 8.5304 8.4879 5.6706 4.1652 4.4509 7.3627 10.4304 8.5628 3.8498 1.1585 1.1762 8.7505 9.3283 1.3297 1.3820 5.1533 11.8667 12.3005 9.6954 15.4396 15.3494 6.5596 5.7860 3.7762 1.9469 2.7373 1.9357 7.7921 16.3241 2.0499 5.3901 3.3301 3.9017 3.3970 3.7567 1.0684 1.0683 1.0680 1.0681
irintensity: 2.2623 0.5835 27.7567 63.8889 76.9477 6.4765 5.9684 0.0729 20.4009 83.7236 76.3522 30.6700 36.5979 214.5992 236.1492 1.9660 20.1551 21.9785 17.0963 13.4569 19.4820 0.4187 25.0210 91.1620 235.2048 143.8761 1030.0620 203.7159 240.0914 30.5461 633.7406 69.9611 92.4814 5.5610 141.6615 132.1393 75.7506 234.5748 26.9995
temp: 298.150 k
press: 1.00000 atm
elementType: 14 14 14 8 8 8 8 8 8 8 8 1 1 1 1
symmnumber: 1
zpe: 191145.5 jmol-1
zpe.correction: 0.072803 hartree
zpe.thermalcorrener: 0.086901 hartree
zpe.thermalcorrenthalpy: 0.087845 hartree
zpe.thermalcorrgfe: 0.032116 hartree
zpe.sumelectzpe: -1471.774402 hartree
zpe.sumelectthermal: -1471.760304 hartree
zpe.sumelectthermalent: -1471.759360 hartree
zpe.sumelectthermalfe: -1471.815089 hartree
dipole: 0.0126 0.0567 2.4260
dipole: 2.4267
quadrupole: -57.1114 -85.7098 -86.1043
quadrupole: -5.0926 0.2314 -0.0238
quadrupole: 19.1971 -9.4013 -9.7958 -5.0926 0.2314 -0.0238
hfenergy: -1471.847205 hartree
pointgroup: C01 [X(H4O8Si3)]
dipole: 0.0292705 -0.0737125 0.9514361 debye
dipolederiv: 2.8378362 -0.0126612 -0.0600652 0.0107336 1.2241069 -0.0006771 -0.0616631 0.0000792 1.2320685 2.8233625 -0.0774214 0.0065936 0.1261565 1.6776553 -0.2622225 -0.135521 -0.2519114 1.6129607 2.8252273 -0.0465218 -0.1025541 0.1445537 1.6207906 0.2530051 0.0615214 0.258002 1.6670422 -1.4490133 -0.0077711 -0.0083762 0.0297425 -0.7030692 -0.0330343 0.0213272 -0.0478675 -0.6954464 -1.4574802 0.043187 0.0162563 -0.015103 -0.6869939 0.044739 0.0739659 0.0250614 -0.6976282 -1.4612586 0.0431536 0.0423968 -0.0066986 -0.6803409 -0.0430416 -0.0172981 -0.0257065 -0.7032526 -1.4477694 -0.0091335 0.063166 0.0248722 -0.7113111 0.0300566 0.0390978 0.0470014 -0.6914999 -0.9702383 0.2499008 -0.1903895 0.2394048 -0.847768 0.0976529 -0.1906166 0.0979239 -0.8245477 -1.0073782 -0.2162875 0.1865727 -0.2829235 -0.7816612 0.0613785 0.2388772 0.0556887 -0.7986173 -0.9439445 0.2149292 0.2307315 0.2043143 -0.8265048 -0.1097508 0.2277713 -0.1107522 -0.8722174 -1.0336929 -0.1989287 -0.1927485 -0.2611322 -0.7744796 -0.0415947 -0.252598 -0.0419638 -0.7784879 0.364387 -0.0793475 0.0591887 -0.1636864 0.3320554 0.081607 0.1328818 0.0790183 0.3652809 0.2812293 0.0913879 -0.0599332 0.0534363 0.3991832 0.0217162 -0.0291885 0.0173225 0.4197723 0.3513803 -0.074559 -0.0704118 -0.149872 0.3525885 -0.0742121 -0.1531059 -0.077173 0.357764 0.2873528 0.0800733 0.0795731 0.0462018 0.4057489 -0.0256223 0.0445485 -0.0247229 0.4068089 unknown
polarizability: 121.4923281|-0.2948053|64.3202145|-2.1087302|0.0796518|63.2689889 unknown
InChI: InChI=1S/H4O8Si3/c1-9(2)5-11(6-9)7-10(3,4)8-11/h1-4H
charge 0 multiplicity 1
15 atoms
Si -0.003397 -0.065721 -0.035415
Si 2.567296 -0.061028 -0.104044
Si -2.572349 -0.089701 0.079881
O  1.289294 0.738713 0.84252
O  -1.312616 0.834031 -0.779981
O  1.24074 -0.88564 -0.962781
O  -1.22795 -0.967204 0.847405
O  3.657415 -1.043586 0.725003
O  3.48011 0.987693 -1.034268
O  -3.607302 0.786641 1.080963
O  -3.543049 -1.040018 -0.896447
H  3.433232 -1.790931 1.318227
H  4.457287 0.965063 -1.101742
H  -3.344146 1.449053 1.753739
H  -4.522664 -1.024364 -0.891061
