program: Gaussian 09
title: 000124929
version: EM64L-G09RevD.01
frameworkgroup: C1[X(C11H14O6)]
method: RPBEPBE
basis: SDD
operation: Freq
keyword: #pfreq=noraman
keyword: PBEPBE/SDD
title: #p freq=noraman PBEPBE/SDD
converged: NO YES NO NO
title: Mulliken charges:
elementType: O O O O O O C C C C C C C C C C C H H H H H H H H H H H H H H
charge: -0.490855 -0.465465 -0.440343 -0.220400 -0.285843 -0.256333 -0.155376 -0.193368 -0.097438 0.354072 0.030711 -0.346216 -0.418870 0.271150 -0.334731 -0.066900 -0.732036 0.254606 0.243585 0.243877 0.260723 0.230376 0.268171 0.379802 0.377200 0.377059 0.255451 0.252697 0.237103 0.231883 0.235707
chargesum: 0.00000
title: Mulliken charges with hydrogens summed into heavy atoms:
elementType: O O O O O O C C C C C C C C C C C
charge: -0.111054 -0.088266 -0.063284 -0.220400 -0.285843 -0.256333 0.099230 0.050218 0.146439 0.354072 0.030711 -0.085493 0.079677 0.271150 -0.079280 0.185797 -0.027342
polarizability: 2.03931467e+02 2.17654574e+01 1.23899084e+02 6.23055599e+00 3.16216121e+00 1.10876691e+02
1716.lowfreq: -5.0550 -0.0002 0.0002 0.0011 2.4436 8.3838 14.3489 27.7268 40.0131
frequency: 12.9686 27.6783 40.0112 75.8631 87.4053 102.1040 124.6453 147.3650 162.8780 200.6615 205.0958 226.8191 230.3887 258.8998 269.2058 304.1563 342.6921 368.7215 388.6378 399.7146 425.5074 447.0019 483.0435 517.0509 550.2700 559.6533 584.5724 618.1100 658.6121 680.3712 715.2895 769.5880 820.1334 841.6846 862.4955 874.5195 890.0501 912.1999 949.5252 967.0829 980.7280 990.3313 997.4054 1001.4128 1053.8418 1059.2648 1090.4996 1094.6627 1116.2301 1146.8463 1151.8670 1201.9056 1206.6585 1229.4987 1238.5672 1274.0153 1291.2478 1297.4888 1305.4685 1323.0254 1350.8599 1359.1431 1370.8309 1378.9550 1388.8189 1394.3194 1456.3330 1461.8859 1464.5299 1583.8733 1623.8040 1644.6281 1667.9321 2947.1300 2970.8014 3000.9174 3014.1639 3019.0184 3043.3557 3085.9144 3087.0137 3110.7888 3125.0720 3155.6848 3407.1720 3481.9627 3540.7028
redmass: 5.6861 5.1452 5.2558 5.5026 3.0433 7.5155 4.6479 1.9295 4.5778 4.9102 1.6999 4.5393 4.8999 4.0512 3.0673 3.3961 4.9886 4.9829 4.2694 5.8285 1.4895 2.9799 4.5536 1.1647 1.5392 2.7626 3.0727 5.2870 3.4323 3.6164 6.3699 3.8660 4.8682 1.8737 3.2530 5.5261 2.4383 2.1306 2.7376 2.9063 4.3046 1.0819 5.2221 2.1210 1.5997 2.3119 3.0388 2.2691 2.2234 1.4626 2.1387 1.1120 1.2597 1.4088 1.2535 1.2126 1.4112 1.3834 1.4603 1.4996 1.4631 1.7397 1.6479 1.3475 2.0946 1.2316 1.0472 1.0913 1.0720 10.6147 11.3709 8.3188 5.7348 1.0809 1.0374 1.0835 1.0858 1.0572 1.0956 1.1073 1.0966 1.0938 1.0919 1.0923 1.0642 1.0652 1.0652
irintensity: 0.0281 1.0411 0.5867 4.2959 2.0043 2.5637 4.8612 0.1686 1.3951 8.2155 0.8753 4.0069 10.7493 18.7866 7.0300 18.7926 42.9107 13.4637 7.2728 4.8852 95.0580 64.5366 37.6107 142.8413 46.5882 26.1354 30.1721 7.4663 11.2889 20.3053 14.4215 18.7108 7.3714 2.1640 61.3348 10.2241 19.8014 3.3133 51.3043 177.3547 69.2747 56.2360 32.1499 88.1910 0.1432 92.6504 81.6867 133.0432 19.5971 99.4085 128.9207 13.0390 5.5567 14.6620 66.2048 38.2362 99.2989 18.6614 3.9290 32.8218 7.4396 67.3901 8.8564 77.8154 19.0869 15.2177 16.6377 23.7569 40.2532 128.8170 183.7092 24.9931 125.6799 27.3057 16.5132 15.5600 44.4498 21.6208 15.9434 7.8864 9.1168 16.3046 7.7594 7.6237 37.3255 44.0714 32.7008
temp: 298.150 k
press: 1.00000 atm
elementType: 8 8 8 8 8 8 6 6 6 6 6 6 6 6 6 6 6 1 1 1 1 1 1 1 1 1 1 1 1 1 1
symmnumber: 1
zpe: 623788.2 jmol-1
zpe.correction: 0.237588 hartree
zpe.thermalcorrener: 0.255258 hartree
zpe.thermalcorrenthalpy: 0.256202 hartree
zpe.thermalcorrgfe: 0.189865 hartree
zpe.sumelectzpe: -877.571449 hartree
zpe.sumelectthermal: -877.553779 hartree
zpe.sumelectthermalent: -877.552835 hartree
zpe.sumelectthermalfe: -877.619172 hartree
dipole: 1.6133 0.3567 -2.8352
dipole: 3.2815
quadrupole: -90.0448 -104.3173 -99.8258
quadrupole: -0.7375 -10.6524 -1.3291
quadrupole: 8.0178 -6.2547 -1.7632 -0.7375 -10.6524 -1.3291
hfenergy: -877.8090372 hartree
pointgroup: C01 [X(C11H14O6)]
dipole: 0.6389198 -0.2512322 1.0933717 debye
polarizability: 202.5538625|-23.2821957|124.4866376|-8.8252604|4.6600495|111.6667413 unknown
InChI: InChI=1S/C11H14O6/c1-2-3-8(13)17-5-6-4-7(12)10(15)11(16)9(6)14/h2-4,7,10-12,15-16H,5H2,1H3
charge 0 multiplicity 1
31 atoms
O  -4.006466 -0.08421 -0.728343
O  -2.836706 -2.534484 -0.043955
O  -3.983025 2.11269 0.761498
O  -0.545976 -1.573483 -1.06814
O  1.63545 0.554846 0.187785
O  3.12081 0.818319 -1.603683
C  -3.466846 -0.293401 0.621535
C  -2.317206 -1.312748 0.559375
C  -2.981992 1.094128 1.097073
C  -0.755391 0.638728 -0.092433
C  -1.133923 -0.781584 -0.271126
C  -1.629873 1.487963 0.531068
C  0.549789 1.097309 -0.685565
C  2.904635 0.451739 -0.422325
C  3.875036 -0.121938 0.53452
C  5.178261 -0.309072 0.183144
C  6.243584 -0.88492 1.074837
H  -4.263612 -0.671412 1.291674
H  -1.942859 -1.512515 1.587939
H  -2.92475 1.099824 2.202759
H  -1.388075 2.55436 0.634799
H  0.630546 2.198252 -0.700608
H  0.700617 0.706181 -1.707108
H  -4.161322 -0.982248 -1.122048
H  -2.104027 -2.895505 -0.622653
H  -4.315606 1.879707 -0.14917
H  3.494087 -0.385234 1.52658
H  5.473576 -0.016108 -0.835825
H  6.68446 -1.792756 0.61845
H  5.854682 -1.149296 2.072558
H  7.076422 -0.165732 1.201689
