program: Gaussian 09
title: 000124918
version: EM64L-G09RevD.01
frameworkgroup: C1[X(C13H16O3S)]
method: RPBEPBE
basis: SDD
operation: Freq
keyword: #p
keyword: freq=noraman
keyword: PBEPBE/SDD
title: #p freq=noraman PBEPBE/SDD
converged: NO YES NO NO
title: Mulliken charges:
elementType: S O O O C C C C C C C C C C C C C H H H H H H H H H H H H H H H H
charge: 0.870937 -0.547849 -0.551371 -0.219825 0.163378 -0.454953 0.616602 -0.615448 -0.331445 -0.712769 -0.714496 -0.522918 -0.259543 0.285475 -0.353011 0.120759 -0.786664 0.279814 0.227708 0.271824 0.294186 0.219592 0.220651 0.239035 0.216444 0.225822 0.236519 0.286549 0.289772 0.257222 0.242767 0.240700 0.264534
chargesum: 0.00000
title: Mulliken charges with hydrogens summed into heavy atoms:
elementType: S O O O C C C C C C C C C C C C C
charge: 0.870937 -0.547849 -0.551371 -0.219825 0.163378 0.052568 0.616602 -0.049438 -0.331445 -0.033490 -0.035710 -0.236369 0.030229 0.285475 -0.095789 0.120759 -0.038663
polarizability: 2.24548831e+02 8.87768035e-01 1.83427226e+02 4.68284363e-01 2.60767354e+00 1.15283450e+02
1716.lowfreq: -11.9721 -6.2239 -5.3513 -0.0014 0.0015 0.0023 41.6526 45.8776 60.3227
frequency: 41.6417 45.8652 60.3148 109.5577 123.2042 145.0858 149.4187 178.9705 195.5707 208.0190 227.0232 242.5698 250.0420 262.2087 292.3360 314.9845 339.3838 358.3437 359.3010 389.1797 420.7963 435.2315 472.0186 483.2899 510.9769 531.4729 551.9631 588.3735 598.5072 650.9768 665.9569 749.6108 759.8427 797.1531 833.4641 840.9574 877.6394 912.6877 929.0572 937.0859 954.8627 962.0672 971.9439 972.7175 1008.1152 1015.8777 1028.7462 1045.8438 1082.8885 1088.0362 1104.1389 1151.9891 1169.9823 1181.5529 1214.6671 1244.6355 1249.9225 1283.8932 1294.7198 1353.4500 1365.8518 1372.5229 1384.9221 1392.8139 1405.7990 1420.4669 1445.3586 1451.0097 1454.5563 1460.1640 1465.1128 1473.0053 1482.3268 1491.0020 1570.6583 1580.0693 1615.7009 2979.8601 2982.5587 2985.0361 2985.4221 3036.5513 3055.2275 3068.4365 3074.2595 3077.7973 3084.9340 3093.1432 3127.7528 3141.9146 3142.4468 3145.2827 3168.7115
redmass: 3.7644 4.7634 5.5097 3.3743 5.3933 1.9717 1.7211 4.3076 6.6400 1.3061 3.9763 2.8065 1.1251 2.7341 3.2462 3.7493 3.0376 3.1277 5.0144 3.7340 3.6607 3.7628 3.7182 5.8148 3.1285 3.1289 2.9385 5.6922 4.4960 3.1945 5.8452 3.6218 3.4668 11.9509 1.5109 2.3182 2.0444 4.8659 1.7365 1.6841 1.4798 1.9249 1.3989 1.7251 5.9872 1.4009 1.8737 2.0330 2.2601 1.3259 2.0322 1.5644 1.5421 2.3913 1.9149 1.7830 2.2513 1.6054 1.7161 1.4063 1.7362 2.6881 1.1928 3.1495 1.2712 1.1025 1.1803 1.0872 2.0391 1.0499 1.0532 1.0562 1.0649 1.0718 6.9104 6.5785 7.7864 1.0358 1.0498 1.0379 1.0462 1.0970 1.0604 1.0967 1.1002 1.0992 1.0994 1.0999 1.0990 1.1089 1.0912 1.0890 1.0958
irintensity: 1.9692 9.2211 1.8458 0.0806 10.2575 1.7690 0.9349 2.2273 2.8019 0.4559 2.5418 4.1491 0.5474 1.8251 0.9756 13.2349 1.5998 3.3140 31.7059 6.8070 7.8212 11.2646 10.2275 1.7987 3.3334 2.1082 4.9518 5.5492 72.8381 4.4506 2.9772 2.9603 1.8266 70.5823 28.2856 13.5211 8.3903 63.9257 20.2330 22.8427 12.0152 18.3553 1.7303 8.1462 0.1212 5.7523 0.6578 3.6603 1.3762 1.3405 18.0777 6.5361 20.8904 5.6079 4.2186 70.2963 134.7600 24.0621 25.5556 3.9512 9.9866 53.9524 18.6341 37.1821 14.4501 13.8352 21.4248 9.0210 11.6632 21.8951 6.6934 10.7046 21.9994 25.9637 26.8988 99.1363 27.3096 22.7160 4.8905 1.5486 37.4550 4.1401 5.1342 9.6114 16.0776 37.3933 25.7022 26.7262 15.8542 2.6802 2.6482 2.0387 6.8248
temp: 298.150 k
press: 1.00000 atm
elementType: 16 8 8 8 6 6 6 6 6 6 6 6 6 6 6 6 6 1 1 1 1 1 1 1 1 1 1 1 1 1 1 1 1
symmnumber: 1
zpe: 683072.5 jmol-1
zpe.correction: 0.260169 hartree
zpe.thermalcorrener: 0.277591 hartree
zpe.thermalcorrenthalpy: 0.278535 hartree
zpe.thermalcorrgfe: 0.215504 hartree
zpe.sumelectzpe: -1127.285827 hartree
zpe.sumelectthermal: -1127.268405 hartree
zpe.sumelectthermalent: -1127.267461 hartree
zpe.sumelectthermalfe: -1127.330492 hartree
dipole: -1.7300 3.0948 -1.7626
dipole: 3.9595
quadrupole: -115.4181 -110.8241 -115.1044
quadrupole: 30.7951 -5.7029 -0.6276
quadrupole: -1.6359 2.9581 -1.3222 30.7951 -5.7029 -0.6276
hfenergy: -1127.5459958 hartree
pointgroup: C01 [X(C13H16O3S1)]
dipole: 0.5726429 -1.2380299 -0.7523542 debye
polarizability: 224.271184|-1.7315497|183.5719991|-4.9919884|-0.5506081|115.4163244 unknown
InChI: InChI=1S/C13H16O3S/c1-9(14)10-4-5-12-11(8-10)13(2,3)6-7-17(12,15)16/h4-5,8H,6-7H2,1-3H3
charge 0 multiplicity 1
33 atoms
S  -2.412125 1.40571 0.221298
O  -2.591979 2.72605 -0.728437
O  -2.863441 1.467174 1.795609
O  3.904408 -1.346165 -0.130033
C  -1.221369 -1.718651 0.028664
C  -2.712869 -1.330387 0.281043
C  -0.241513 -0.518002 0.068454
C  -3.244476 -0.152101 -0.536988
C  -0.602109 0.85203 0.105646
C  -1.096145 -2.398306 -1.370407
C  -0.839146 -2.74759 1.133109
C  1.152572 -0.768073 -0.002105
C  0.320642 1.914188 0.060654
C  2.118565 0.267207 -0.025834
C  1.694512 1.622158 0.000322
C  3.574888 -0.124984 -0.094312
C  4.63165 0.970936 -0.119402
H  -2.869952 -1.099352 1.353647
H  -3.335592 -2.21813 0.057631
H  -2.966863 -0.136488 -1.602191
H  -4.322398 0.029478 -0.402794
H  -1.742661 -3.294363 -1.414027
H  -1.391005 -1.716586 -2.189004
H  -0.058164 -2.718798 -1.566291
H  -1.561148 -3.585513 1.129304
H  0.16525 -3.174995 0.97249
H  -0.857879 -2.280071 2.133784
H  1.533821 -1.794309 -0.041733
H  -0.046792 2.945931 0.051001
H  2.419905 2.440402 -0.031763
H  4.571243 1.602691 0.786524
H  4.496017 1.63462 -0.99384
H  5.628454 0.508289 -0.16992
