program: Gaussian 09
title: 000014925
version: EM64L-G09RevD.01
frameworkgroup: C1[X(C6H8O6)]
method: RPBEPBE
basis: SDD
operation: Freq
keyword: #p
keyword: freq=noraman
keyword: PBEPBE/SDD
title: #p freq=noraman PBEPBE/SDD
converged: YES YES NO NO
title: Mulliken charges:
elementType: O O O O O O C C C C C C H H H H H H H H
charge: -0.423747 -0.219753 -0.412019 -0.409286 -0.237063 -0.230998 -0.113516 -0.532395 -0.537224 0.167076 0.203356 0.187593 0.294698 0.289374 0.265822 0.263310 0.297314 0.384686 0.379913 0.382860
chargesum: 0.00000
title: Mulliken charges with hydrogens summed into heavy atoms:
elementType: O O O O O O C C C C C C
charge: -0.039061 -0.219753 -0.032106 -0.026426 -0.237063 -0.230998 0.181182 0.022800 0.023399 0.167076 0.203356 0.187593
polarizability: 9.44612206e+01 7.46642339e-01 8.24495248e+01 -7.71777760e-02 2.13756459e+00 6.66173911e+01
1716.lowfreq: -12.7489 -9.8205 -0.0007 0.0004 0.0007 1.1017 29.5322 37.4703 51.2847
frequency: 29.5269 37.4288 51.2658 72.7194 76.7187 119.5808 164.0308 219.4608 272.5133 286.1267 347.3363 436.5774 487.2545 491.5487 522.6382 561.5961 575.7239 602.9565 631.3414 642.3289 644.5506 689.2617 796.3632 849.0592 874.7141 913.0979 990.0462 1030.2808 1045.9992 1053.7584 1093.6374 1134.5575 1181.0542 1212.2769 1243.3783 1257.9731 1266.0810 1299.6588 1341.3442 1365.2735 1377.7026 1425.9838 1440.7264 1661.4835 1667.4140 1670.1566 3007.5990 3018.6809 3034.2890 3066.0052 3081.1956 3513.8975 3516.9747 3521.1738
redmass: 11.9407 11.2174 5.4838 10.5962 4.4687 7.7957 3.4015 4.8647 4.2578 4.4786 6.5281 3.9723 2.3064 1.9875 2.6630 3.6729 3.0655 1.5459 3.2334 1.6534 1.3778 3.6223 3.7644 2.7924 4.2396 2.7325 2.6078 3.3139 2.3122 2.5290 2.3520 2.0455 1.1982 1.2808 1.3414 1.4930 1.6813 1.5703 1.9221 1.9492 1.9685 1.0893 1.0923 8.6074 8.2087 8.7256 1.0616 1.0611 1.0820 1.0988 1.0996 1.0641 1.0640 1.0642
irintensity: 1.9306 0.8374 0.3093 0.6392 1.3974 0.3834 5.3109 2.3611 1.7714 2.4640 0.4253 22.5807 4.8584 16.2368 105.3622 94.8688 32.3063 102.0944 25.4313 97.5912 115.1469 31.3271 10.6703 5.5512 10.2462 20.2824 67.6220 8.8832 282.4071 490.0853 17.7900 11.7807 7.5652 20.5325 0.8120 7.4768 10.3898 37.6710 75.8831 70.2791 22.5400 34.0267 40.1662 289.9066 185.8555 158.4733 8.8671 4.8673 3.1933 3.0496 1.9549 30.5442 27.6835 29.0965
temp: 298.150 k
press: 1.00000 atm
elementType: 8 8 8 8 8 8 6 6 6 6 6 6 1 1 1 1 1 1 1 1
symmnumber: 1
zpe: 376311.2 jmol-1
zpe.correction: 0.143329 hartree
zpe.thermalcorrener: 0.155972 hartree
zpe.thermalcorrenthalpy: 0.156917 hartree
zpe.thermalcorrgfe: 0.101890 hartree
zpe.sumelectzpe: -683.883240 hartree
zpe.sumelectthermal: -683.870597 hartree
zpe.sumelectthermalent: -683.869653 hartree
zpe.sumelectthermalfe: -683.924679 hartree
dipole: 2.2361 0.4395 -1.0855
dipole: 2.5242
quadrupole: -61.5517 -62.1382 -75.8820
quadrupole: 2.0402 -1.2787 3.3883
quadrupole: 4.9722 4.3858 -9.3580 2.0402 -1.2787 3.3883
hfenergy: -684.0265694 hartree
pointgroup: C01 [X(C6H8O6)]
dipole: 0.852821 -0.3389891 0.379515 debye
dipolederiv: -0.3792236 0.1432166 0.0654547 0.2163491 -0.8520048 -0.4668759 0.0893041 -0.4277144 -0.7489319 -0.7284667 0.0002434 0.3426495 -0.2076838 -0.595144 0.0069389 0.2809129 -0.1347438 -0.5943984 -0.5718581 0.3217684 0.3634591 0.2830361 -0.8323955 -0.3762302 0.3130517 -0.3439892 -0.6267592 -1.2724785 0.2481637 -0.2837603 0.1757836 -0.3379717 -0.0070434 -0.2828514 0.0113614 -0.4777644 -0.5826203 0.0720923 -0.2618839 0.188525 -0.5263433 -0.1123991 -0.0707901 -0.2501432 -0.8480212 -0.7249183 -0.0680784 -0.0252704 0.1822338 -0.801415 0.2861396 -0.1317756 0.2358365 -0.4434444 -0.0856735 -0.1974011 0.0163114 -0.1229041 -0.0319745 -0.0174802 0.0144289 0.0559504 0.0610916 -0.290555 0.1368669 -0.1277616 0.0542429 0.0221343 -0.0375214 -0.1948677 0.0189112 -0.0244667 -0.0309175 -0.06654 0.0272225 -0.2825589 -0.2984605 0.0728859 0.0947457 0.0798979 0.1174091 0.884426 0.1307629 -0.4983794 0.2459599 1.1961531 0.4463919 -0.477836 0.4718712 0.8995983 1.0175135 -0.5206911 0.1091568 -0.5610472 0.9051485 0.4724868 0.038314 0.5196725 1.1829556 1.6262145 -0.0269998 0.2717767 -0.0771176 1.0303365 -0.4328184 0.3412379 -0.4157945 0.4636039 0.1264749 -0.0117465 -0.0015817 0.0263768 0.0779692 0.0180023 0.0077465 -0.0093361 -0.0128535 0.0978506 -0.0680296 -0.0244612 -0.0418904 -0.0017203 -0.0066686 -0.0369342 0.0112566 0.1123739 0.0827002 0.0362325 0.0327228 0.032582 0.0836378 0.0658301 0.0270228 0.0205359 -0.0192122 0.0441677 -0.0263763 0.0092566 -0.0072265 0.1231022 0.01379 -0.0369669 0.0402608 -0.0514136 0.0587296 0.0496162 0.025254 0.0711466 0.0401624 -0.0407062 0.0483405 -0.0508459 0.0866379 0.2090061 -0.1383143 0.0592071 -0.0986787 0.2673279 0.021716 0.0939709 0.0462579 0.3398728 0.2113176 0.0587792 -0.1158665 0.0338778 0.3642566 0.0039285 -0.1518652 0.0238092 0.2356977 0.3083107 -0.0735649 0.016494 -0.1110065 0.1672011 0.0896331 0.0348113 0.0969456 0.3480246 unknown
polarizability: 94.1135693|-2.1734806|81.7721953|-0.0005251|4.4718004|67.6423719 unknown
InChI: InChI=1S/C6H8O6/c7-4(8)1-3(6(11)12)2-5(9)10/h3,7,9,11H,1-2H2
charge 0 multiplicity 1
20 atoms
O  -0.538039 -2.513997 -1.069932
O  -1.890122 -1.730133 0.646424
O  -2.47523 2.251442 0.982265
O  3.713745 -0.078875 0.450414
O  -2.357008 1.09432 -1.027065
O  2.282364 1.406126 -0.615217
C  -0.006214 -0.33498 -0.182871
C  -0.580071 0.807606 0.673922
C  1.420848 -0.753838 0.255053
C  -0.925817 -1.553184 -0.126646
C  -1.870958 1.35503 0.094793
C  2.459471 0.315825 -0.029107
H  0.033256 -0.009645 -1.238954
H  0.143642 1.641986 0.717324
H  -0.777036 0.47922 1.709708
H  1.459982 -1.002481 1.332437
H  1.728251 -1.668041 -0.285765
H  -1.159882 -3.289986 -1.028525
H  -3.31197 2.604086 0.57376
H  4.385989 0.625218 0.240182
