program: Gaussian 09
title: 000124844
version: EM64L-G09RevD.01
frameworkgroup: C1[X(C12H17NO2)]
method: RPBEPBE
basis: SDD
operation: Freq
keyword: #p
keyword: freq=noraman
keyword: PBEPBE/SDD
title: #p freq=noraman PBEPBE/SDD
converged: YES YES NO NO
title: Mulliken charges:
elementType: O O N C C C C C C C C C C C C H H H H H H H H H H H H H H H H H
charge: -0.269095 -0.265038 -0.339294 -0.019040 -0.649426 -0.389239 0.571781 -0.537607 -0.702021 -0.404201 0.193561 0.159204 -0.338562 -0.643639 -0.204233 0.205120 0.242079 0.193644 0.207163 0.221871 0.256578 0.257556 0.245271 0.208148 0.206071 0.234749 0.247562 0.231309 0.192602 0.217585 0.229928 0.239610
chargesum: 0.00000
title: Mulliken charges with hydrogens summed into heavy atoms:
elementType: O O N C C C C C C C C C C C C
charge: -0.269095 -0.265038 -0.082716 0.186080 -0.213702 0.039795 0.571781 -0.280051 -0.042530 -0.169451 0.193561 0.159204 -0.091000 -0.002143 0.265305
polarizability: 1.95674645e+02 -1.16823718e+01 1.34105519e+02 1.20854114e+01 5.92627543e+00 9.73658603e+01
1716.lowfreq: -27.3211 -10.0049 -3.1896 -0.0003 -0.0002 0.0004 19.9409 40.8921 56.1556
frequency: 13.7607 40.8432 56.1471 83.7050 92.3653 126.4600 163.7006 184.0997 194.2926 221.5527 236.9143 268.7993 295.7308 327.2662 329.2035 411.0103 419.1384 455.1645 516.5085 548.0035 590.2952 622.9553 654.7058 676.6284 715.7903 750.9969 763.9466 780.0737 786.5517 818.5528 838.7275 875.2042 903.5463 927.5315 928.9778 954.0079 973.4728 980.7392 1055.2008 1056.6550 1065.9111 1071.1625 1100.4359 1107.0656 1126.8335 1129.9835 1159.7761 1175.4525 1186.9390 1192.9958 1251.6610 1264.5824 1271.0512 1280.8919 1316.1136 1337.4384 1357.7139 1362.9779 1384.1574 1394.0607 1435.9841 1437.9303 1453.4570 1462.8950 1465.9864 1475.6883 1477.2044 1478.7087 1485.8262 1489.1472 1501.4941 1610.7435 1628.3334 2820.0569 2869.8163 2966.6747 2982.3433 2988.1016 2994.7970 3016.7994 3033.6002 3049.7815 3071.0983 3074.4120 3087.5938 3105.1669 3133.1786 3164.6268 3178.3629 3447.3975
redmass: 3.7260 3.7979 3.7184 2.5894 2.5082 1.5944 2.6577 1.5722 1.5840 4.4530 4.9934 2.0346 2.5347 4.5037 2.5092 3.0021 3.4104 2.5058 5.4585 2.1404 4.6711 4.0802 1.7201 8.9519 4.4891 3.9922 2.0709 4.8084 1.4790 1.5823 7.7109 1.4898 3.3570 1.9051 1.3751 1.9418 4.0383 2.0311 1.8701 3.0887 1.8688 1.5059 1.9110 1.2981 1.1680 1.2776 1.7867 1.8199 2.0062 1.6532 3.6591 1.1627 1.3342 1.4591 1.5385 1.4747 1.3286 1.2712 1.2298 4.1130 1.1986 3.9241 1.1377 1.0753 1.1425 1.8011 1.0875 1.0832 1.4925 1.0581 1.0551 7.8253 8.3014 1.0807 1.0564 1.0659 1.0372 1.0611 1.0613 1.0744 1.0985 1.0946 1.0990 1.0993 1.0999 1.1098 1.0897 1.0929 1.0954 1.0746
irintensity: 0.2655 0.5661 1.0401 15.2820 0.7419 1.0456 0.9204 0.7141 0.6153 0.9769 1.0996 4.5139 0.9718 1.9176 1.2600 5.7012 2.5142 22.1633 4.5750 33.5255 3.6051 25.4323 44.5803 0.6550 1.9389 5.4916 14.2229 10.4618 23.5171 24.7326 30.4432 20.9623 3.6828 2.8001 1.2376 4.5950 109.7386 40.9653 15.8009 12.0971 7.2918 8.9771 2.6620 0.5877 3.9784 11.7884 20.9210 50.2635 13.3831 10.3839 159.0608 1.6641 1.0655 25.5432 1.1636 27.8631 2.4534 0.8791 24.7338 12.5599 0.7831 48.3860 21.5942 2.0702 9.0112 83.4803 17.4934 22.4068 50.1045 18.6959 12.3444 6.4677 0.6225 89.9684 140.6486 47.7068 40.8095 19.5521 127.9341 45.7132 25.1836 23.9864 59.8244 46.9614 32.1895 33.3251 12.3985 4.7704 4.6832 1.9406
temp: 298.150 k
press: 1.00000 atm
elementType: 8 8 7 6 6 6 6 6 6 6 6 6 6 6 6 1 1 1 1 1 1 1 1 1 1 1 1 1 1 1 1 1
symmnumber: 1
zpe: 703186.7 jmol-1
zpe.correction: 0.267830 hartree
zpe.thermalcorrener: 0.283126 hartree
zpe.thermalcorrenthalpy: 0.284070 hartree
zpe.thermalcorrgfe: 0.223628 hartree
zpe.sumelectzpe: -671.485900 hartree
zpe.sumelectthermal: -671.470604 hartree
zpe.sumelectthermalent: -671.469660 hartree
zpe.sumelectthermalfe: -671.530101 hartree
dipole: 0.4837 -0.8636 -0.7420
dipole: 1.2371
quadrupole: -82.6800 -88.6209 -91.7830
quadrupole: -8.8064 1.4362 -2.1059
quadrupole: 5.0147 -0.9263 -4.0884 -8.8064 1.4362 -2.1059
hfenergy: -671.7537294 hartree
pointgroup: C01 [X(C12H17N1O2)]
dipole: 0.1692935 -0.3182661 -0.3269946 debye
polarizability: 194.8011904|-15.4327221|133.9166624|9.3430659|9.167179|98.4281713 unknown
InChI: InChI=1S/C12H17NO2/c1-3-10(13-2)6-9-4-5-11-12(7-9)15-8-14-11/h4-5,7,10,13H,3,6,8H2,1-2H3
charge 0 multiplicity 1
32 atoms
O  -2.990684 1.606983 0.59385
O  -3.948434 -0.293323 -0.515253
N  3.942082 -0.604446 0.316446
C  2.567595 -0.382194 -0.193804
C  1.578962 -0.575517 0.996276
C  2.437957 1.008784 -0.872255
C  0.113929 -0.544423 0.587147
C  -0.681487 0.612751 0.843047
C  2.829301 2.201046 0.026879
C  -0.467742 -1.661626 -0.068687
C  -2.010845 0.59344 0.416998
C  -2.573639 -0.522246 -0.236496
C  -1.825443 -1.673608 -0.490584
C  5.009375 -0.674121 -0.697416
C  -4.172101 1.136879 -0.177117
H  2.299542 -1.143866 -0.974117
H  1.792661 0.195267 1.758212
H  1.806179 -1.556121 1.465078
H  3.070561 1.016207 -1.781898
H  1.395021 1.119497 -1.225812
H  3.97315 -1.405617 0.960364
H  -0.265238 1.484137 1.356601
H  3.82844 2.037399 0.467134
H  2.116475 2.338595 0.860662
H  2.844816 3.141771 -0.553591
H  0.147738 -2.55035 -0.250537
H  -2.267442 -2.542302 -0.985165
H  5.181565 0.321162 -1.146104
H  4.79802 -1.386348 -1.533429
H  5.953621 -0.982304 -0.214137
H  -4.246363 1.722086 -1.113771
H  -5.06917 1.219906 0.45548
