program: Gaussian 09
title: 000124819
version: EM64L-G09RevD.01
frameworkgroup: C1[X(C13H14N2O6)]
method: RPBEPBE
basis: SDD
operation: Freq
keyword: #p
keyword: freq=noraman
keyword: PBEPBE/SDD
title: #p freq=noraman PBEPBE/SDD
converged: YES YES NO NO
title: Mulliken charges:
elementType: O O O O O O N N C C C C C C C C C C C C C H H H H H H H H H H H H H H
charge: -0.446246 -0.428528 -0.160799 -0.450026 -0.230368 -0.227449 -0.411833 0.017974 -0.170166 -0.162683 -0.223905 0.294623 -0.401113 0.079110 -0.489677 0.468294 -0.406183 -0.306049 -0.346321 -0.377188 0.383737 0.256454 0.256742 0.253384 0.257243 0.304167 0.229429 0.261567 0.376420 0.376312 0.227392 0.268944 0.285020 0.284092 0.357630
chargesum: 0.00000
title: Mulliken charges with hydrogens summed into heavy atoms:
elementType: O O O O O O N N C C C C C C C C C C C C C
charge: -0.069826 -0.052217 -0.160799 -0.092395 -0.230368 -0.227449 -0.107665 0.017974 0.086289 0.094059 0.029479 0.294623 -0.143870 0.079110 0.001319 0.468294 -0.178791 -0.037105 -0.061301 -0.093096 0.383737
polarizability: 3.30144304e+02 3.13641512e+00 1.40528867e+02 -3.31448697e-01 -1.88518197e+01 1.35092982e+02
1716.lowfreq: -7.7347 -0.0008 -0.0007 -0.0006 3.0898 3.9323 24.8246 30.7969 33.8449
frequency: 24.6063 30.7298 33.7667 38.5392 76.5081 82.8519 94.0615 120.1249 144.5818 189.8878 208.7611 230.9226 254.8236 272.4626 284.0821 297.8135 308.4856 337.0332 359.2349 393.0651 405.0275 407.8845 414.7897 454.0335 468.1924 482.9773 493.9523 511.7108 522.0653 583.5570 597.5685 622.7194 626.1615 641.0737 662.4995 703.6450 728.7076 740.1914 773.8702 810.3031 817.0941 838.0655 865.6775 869.1731 878.1926 899.7224 923.9180 963.7434 974.0329 974.7233 979.5823 992.6592 1054.3837 1072.7076 1074.9055 1099.4733 1108.9165 1121.6583 1132.1256 1175.2199 1182.3987 1192.6672 1218.5403 1232.4604 1264.9703 1278.8935 1290.1872 1296.3852 1306.5563 1314.6494 1324.9771 1334.8269 1349.1666 1353.9621 1376.0690 1391.6546 1403.5573 1444.8768 1461.2493 1483.6250 1507.9993 1588.5476 1619.0305 1646.5751 1661.7427 2917.3539 3009.4101 3014.7111 3023.7577 3099.1361 3112.6030 3126.8151 3171.1633 3182.1911 3189.6449 3349.3685 3454.3440 3538.5892 3567.0006
redmass: 8.3059 8.0644 5.9717 6.1137 7.6970 7.7189 5.8135 7.2178 3.9952 6.8610 6.8012 7.4758 5.5293 2.5842 4.5120 5.0261 5.6734 3.2065 1.7038 2.5275 1.4631 5.0608 2.9279 4.6108 3.9132 1.5540 3.4796 3.1541 5.0000 4.1383 1.1047 6.2965 6.7873 5.4245 4.4218 4.7057 4.7242 5.3597 6.6267 1.5612 2.4061 1.8431 2.8811 3.2349 4.1802 2.6515 3.1023 2.2702 3.8292 1.3538 1.3484 3.0451 2.0908 4.2547 3.2061 2.9426 2.4605 1.3444 1.2672 1.9011 1.5090 1.4637 1.5853 4.1911 1.3460 1.5790 1.3883 1.3397 1.3519 1.6015 1.4228 1.5664 5.6901 1.1740 1.3974 3.3757 1.2346 4.5237 1.0942 1.9229 2.5800 5.7577 6.5131 10.1138 7.9763 1.0797 1.0835 1.0627 1.0853 1.1036 1.0916 1.0903 1.0882 1.0944 1.0965 1.0680 1.0646 1.0766 1.0667
irintensity: 7.3919 0.5273 0.3204 3.8775 0.2910 0.6432 2.6813 7.4499 6.4809 3.6224 10.9420 3.8039 5.5687 13.3158 10.7450 8.8471 1.2367 8.5990 63.1271 20.8664 173.5509 2.2082 0.3382 7.7298 6.6937 55.3113 0.1704 3.3970 6.6176 5.4517 261.8545 2.9858 1.6881 23.5254 25.1597 3.9972 4.3228 9.2643 8.1522 5.3514 8.3864 68.7360 21.8437 79.7845 11.0390 18.6887 8.8345 45.1893 111.9041 9.0748 0.2194 1.1143 12.3176 92.1760 41.6456 22.7677 4.7122 26.9660 47.0322 198.8083 156.2967 7.6222 18.5520 583.8493 13.2605 41.5449 27.4622 7.6226 16.6275 29.9800 48.9683 25.2375 94.7216 19.0959 37.1003 112.0492 102.1798 4.9266 12.8824 3.1245 243.2039 16.4355 477.7381 112.5518 8.5003 19.6544 20.6409 38.6350 15.9084 8.0923 13.0802 12.5270 1.4521 1.0259 7.6490 189.0393 31.4760 43.2934 11.2545
temp: 298.150 k
press: 1.00000 atm
elementType: 8 8 8 8 8 8 7 7 6 6 6 6 6 6 6 6 6 6 6 6 6 1 1 1 1 1 1 1 1 1 1 1 1 1 1
symmnumber: 1
zpe: 685046.9 jmol-1
zpe.correction: 0.260921 hartree
zpe.thermalcorrener: 0.280499 hartree
zpe.thermalcorrenthalpy: 0.281443 hartree
zpe.thermalcorrgfe: 0.211034 hartree
zpe.sumelectzpe: -1062.949666 hartree
zpe.sumelectthermal: -1062.930087 hartree
zpe.sumelectthermalent: -1062.929143 hartree
zpe.sumelectthermalfe: -1062.999553 hartree
dipole: -7.8207 -4.1856 -3.8695
dipole: 9.6776
quadrupole: -186.6336 -117.6670 -121.2874
quadrupole: 10.6238 16.9652 -5.2818
quadrupole: -44.7709 24.1957 20.5753 10.6238 16.9652 -5.2818
hfenergy: -1063.2105863 hartree
pointgroup: C01 [X(C13H14N2O6)]
dipole: 2.6239856 2.7034709 -0.5501763 debye
polarizability: 321.2307795|41.0498334|133.3930735|5.2883136|15.3522491|151.1423004 unknown
InChI: InChI=1S/C13H14N2O6/c16-6-7-5-10(12(18)13(19)11(7)17)14-8-1-3-9(4-2-8)15(20)21/h1-5,10-12,14,16-18H,6H2
charge 0 multiplicity 1
35 atoms
O  0.962041 -2.214457 -1.14358
O  4.830846 0.033637 1.007808
O  2.710211 -1.904182 0.945816
O  4.279298 2.680235 1.428311
O  -6.228715 -0.741451 1.004885
O  -6.00687 -1.495634 -1.140955
N  0.032346 0.227387 0.148464
N  -5.517278 -0.996758 -0.049112
C  0.977892 0.280576 -0.973753
C  1.812745 -1.052541 -1.137823
C  3.898308 0.015516 -0.098881
C  3.200039 1.366889 -0.349197
C  1.91001 1.468503 -0.777504
C  2.832839 -1.084308 0.004248
C  4.04393 2.589351 -0.046809
C  -1.320007 -0.111675 0.074919
C  -2.154946 0.146969 1.207694
C  -1.900778 -0.698528 -1.090935
C  -3.52268 -0.148039 1.174016
C  -3.273277 -0.981581 -1.130524
C  -4.081966 -0.700821 -0.003644
H  0.391858 0.418637 -1.901092
H  2.333525 -1.002197 -2.113539
H  4.500548 -0.224722 -1.005695
H  1.475553 2.460467 -0.960967
H  0.387001 0.534095 1.056188
H  3.568447 3.515204 -0.420104
H  5.059334 2.503422 -0.465419
H  1.028931 -2.642739 -0.244731
H  4.689907 0.86286 1.552828
H  -1.717824 0.588696 2.111456
H  -1.26777 -0.988562 -1.932195
H  -4.171681 0.04805 2.031431
H  -3.731883 -1.437413 -2.01208
H  3.453963 3.001413 1.872475
