program: Gaussian 09
title: 000124787
version: EM64L-G09RevD.01
frameworkgroup: C1[X(C10H18N2O3)]
method: RPBEPBE
basis: SDD
operation: Freq
keyword: #p
keyword: freq=noraman
keyword: PBEPBE/SDD
title: #p freq=noraman PBEPBE/SDD
converged: YES YES NO NO
title: Mulliken charges:
elementType: O O O N N C C C C C C C C C C H H H H H H H H H H H H H H H H H H
charge: -0.327365 -0.284214 -0.320110 -0.330277 -0.422432 -0.091861 -0.432075 -0.401959 -0.385390 0.111088 0.339567 0.300041 -0.713194 -0.703892 -0.713560 0.262518 0.210279 0.281462 0.220533 0.222142 0.226920 0.222593 0.324600 0.356931 0.220311 0.206651 0.268524 0.227284 0.229325 0.201243 0.268237 0.207108 0.218971
chargesum: 0.00000
title: Mulliken charges with hydrogens summed into heavy atoms:
elementType: O O O N N C C C C C C C C C C
charge: -0.327365 -0.284214 -0.320110 -0.005677 -0.065501 0.170657 0.059667 0.040716 0.064123 0.111088 0.339567 0.300041 -0.017708 -0.046040 -0.019244
polarizability: 1.72265964e+02 -5.96613773e+00 1.24748012e+02 -9.09932031e-01 -1.88179937e+00 9.76891469e+01
1716.lowfreq: -8.6038 -0.9198 0.0004 0.0004 0.0007 5.0933 38.6591 44.5881 63.8289
frequency: 38.1349 44.4683 63.7926 83.0284 110.8917 130.8606 158.6736 181.7653 189.4618 207.4887 238.5369 248.4976 279.4418 296.4844 309.7430 332.2138 372.7814 397.8125 415.6408 434.5787 450.0854 493.8184 518.9232 623.8877 635.2213 657.3222 696.6828 706.4448 714.0837 744.5780 787.8599 836.8006 870.2180 890.4674 914.1034 915.6226 919.5235 954.1538 970.8427 999.2226 1030.7661 1032.8814 1069.9496 1097.7205 1117.3139 1151.3631 1163.4208 1182.7569 1199.1485 1219.0555 1254.7233 1256.3858 1270.6103 1284.4493 1310.7084 1322.1835 1347.0031 1351.8347 1372.6072 1376.1934 1395.6128 1398.3193 1431.6817 1444.8602 1466.4924 1466.8152 1468.3781 1469.5657 1470.0123 1479.0626 1480.4627 1493.0132 1502.2642 1620.1817 1634.3007 2938.2432 2958.2929 2987.8236 2989.3929 2994.3719 2994.6989 3002.9356 3028.3601 3065.0262 3079.4610 3082.7268 3083.7760 3095.3731 3099.0969 3112.7315 3117.5870 3499.0650 3510.4071
redmass: 3.4595 3.9374 3.8521 4.4948 4.9008 3.9985 3.2773 1.1083 3.7632 4.2946 1.0656 1.0633 2.0491 3.3852 4.4907 2.5673 2.9045 2.8153 2.9912 2.8406 3.6644 4.2895 3.6035 2.4138 1.4356 2.0746 3.8704 1.9530 8.5125 3.5995 3.0925 3.2230 2.1351 2.2744 1.6000 1.7078 1.6185 1.2031 3.0909 3.8335 1.4154 1.4287 1.8182 2.3697 1.8211 2.5262 1.4875 2.7718 1.5903 1.6192 1.3236 2.9867 2.8605 1.6581 1.2368 1.6720 1.3654 1.4852 1.2335 1.2350 1.7920 1.2214 2.1782 1.0469 1.4380 1.0617 1.0846 1.2339 1.1269 1.1276 1.0595 1.1342 1.0622 5.8132 6.9932 1.0809 1.0652 1.0361 1.0357 1.0650 1.0374 1.0630 1.0955 1.1003 1.0993 1.0991 1.1012 1.0991 1.1004 1.1001 1.0992 1.0768 1.0756
irintensity: 0.3024 5.1243 2.7598 2.8806 3.6463 0.1666 0.5893 0.6096 18.1350 1.9197 0.0095 0.1351 1.9498 3.5795 8.7999 2.2515 8.2672 2.1259 10.6211 3.1335 3.1797 15.6558 7.5710 31.6886 44.9958 17.9009 18.1104 73.6529 43.2153 21.1429 6.7103 13.8976 14.3685 7.4561 0.6244 3.4732 1.5327 0.2636 117.8054 126.2771 0.0364 8.9174 5.1698 25.1029 5.7819 299.2829 94.8582 50.2654 9.9469 13.2156 21.4879 26.6134 20.0623 7.2430 3.6106 166.5554 7.1336 3.2100 43.3582 41.2051 134.4691 27.3916 22.3358 0.7658 270.6718 7.2658 43.3299 92.1221 71.2562 8.0959 7.9257 18.4578 52.8288 340.9264 137.4635 26.9642 65.3121 26.9768 10.2906 16.3680 31.6102 25.8188 52.3574 40.9592 11.1701 19.8349 12.7431 61.5270 30.6468 5.5731 16.2944 106.5118 21.3626
temp: 298.150 k
press: 1.00000 atm
elementType: 8 8 8 7 7 6 6 6 6 6 6 6 6 6 6 1 1 1 1 1 1 1 1 1 1 1 1 1 1 1 1 1 1
symmnumber: 1
zpe: 730353.8 jmol-1
zpe.correction: 0.278177 hartree
zpe.thermalcorrener: 0.294410 hartree
zpe.thermalcorrenthalpy: 0.295354 hartree
zpe.thermalcorrgfe: 0.234415 hartree
zpe.sumelectzpe: -725.891957 hartree
zpe.sumelectthermal: -725.875724 hartree
zpe.sumelectthermalent: -725.874780 hartree
zpe.sumelectthermalfe: -725.935720 hartree
dipole: 2.7130 -1.8291 -0.9187
dipole: 3.3985
quadrupole: -60.8218 -100.7179 -90.4358
quadrupole: -7.1491 -1.0921 1.3003
quadrupole: 23.1700 -16.7260 -6.4440 -7.1491 -1.0921 1.3003
hfenergy: -726.1701346 hartree
pointgroup: C01 [X(C10H18N2O3)]
dipole: -1.0658065 -0.7915699 0.1590244 debye
polarizability: 172.2966567|6.0637017|121.3356291|-0.7436983|9.0082225|101.070837 unknown
InChI: InChI=1S/C10H18N2O3/c1-10(2,3)15-9(14)12-7-5-4-6-11-8(7)13/h7,11-12H,4-6H2,1-3H3
charge 0 multiplicity 1
33 atoms
O  2.095247 0.450163 0.453368
O  -2.097117 2.280588 0.726591
O  0.994316 -1.134942 -0.939286
N  -3.81191 0.758421 0.384396
N  -0.165415 0.426909 0.36212
C  -1.485341 0.06565 -0.154861
C  -1.945208 -1.368306 0.204202
C  -3.357046 -1.58288 -0.377998
C  -4.368498 -0.610414 0.260972
C  -2.482299 1.124213 0.361114
C  3.497696 -0.01847 0.09621
C  0.976953 -0.172134 -0.118139
C  3.738174 0.189359 -1.413097
C  4.370685 0.925074 0.941986
C  3.675812 -1.488922 0.525483
H  -1.476911 0.134748 -1.265671
H  -1.946915 -1.495195 1.304154
H  -1.224065 -2.086001 -0.220611
H  -3.327555 -1.431035 -1.474376
H  -3.702377 -2.617551 -0.203054
H  -5.29552 -0.565952 -0.340953
H  -4.645897 -0.976148 1.271819
H  -4.442008 1.498738 0.708768
H  -0.099799 1.307678 0.88387
H  3.543776 1.240341 -1.692277
H  4.79172 -0.042373 -1.655049
H  3.083421 -0.466967 -2.007528
H  4.152964 0.796019 2.016206
H  4.177514 1.977443 0.671792
H  5.439621 0.705905 0.768757
H  3.026977 -2.151292 -0.068501
H  4.72882 -1.790459 0.376025
H  3.431085 -1.608809 1.595963
