program: Gaussian 09
title: 000014913
version: EM64L-G09RevD.01
frameworkgroup: C1[X(C14H26O2)]
method: RPBEPBE
basis: SDD
operation: Freq
keyword: #pfreq=noraman
keyword: PBEPBE/SDD
title: #p freq=noraman PBEPBE/SDD
converged: YES YES NO NO
title: Mulliken charges:
elementType: O O C C C C C C C C C C C C C C H H H H H H H H H H H H H H H H H H H H H H H H H H
charge: -0.447116 -0.437352 0.005075 -0.050429 -0.044852 -0.208346 -0.791719 -0.772805 -0.740740 -0.741677 -0.039912 -0.127296 -0.086369 -0.062412 -0.701802 -0.718672 0.177175 0.218658 0.203805 0.237212 0.227778 0.230951 0.214090 0.218990 0.205542 0.262482 0.220909 0.222843 0.211483 0.214834 0.212257 0.213133 0.220114 0.341851 0.216975 0.212328 0.222201 0.245774 0.240226 0.228784 0.209414 0.336613
chargesum: 0.00000
title: Mulliken charges with hydrogens summed into heavy atoms:
elementType: O O C C C C C C C C C C C C C C
charge: -0.105264 -0.100739 0.182250 0.168230 0.158953 0.028866 -0.118900 -0.085790 -0.085506 -0.101453 -0.039912 0.092819 0.130606 -0.062412 -0.021499 -0.040248
polarizability: 1.87656215e+02 -4.94853511e+00 1.55923080e+02 -1.73567801e+00 1.12709155e+00 1.35218433e+02
1716.lowfreq: -15.4120 -11.7350 -3.5234 -0.0009 -0.0008 0.0002 11.9996 26.8378 37.8412
frequency: 8.1977 26.4389 37.6684 53.9523 65.2028 82.9414 91.0928 126.7856 161.2753 174.4315 185.3881 201.5427 204.9249 217.7498 234.7675 239.1655 245.5088 248.6091 269.6532 287.6859 292.9320 315.7732 335.9191 348.9087 355.8557 361.0746 382.6494 410.4130 435.2038 479.6297 525.2546 541.1821 563.4072 587.9920 665.2472 723.4308 750.4372 786.2196 827.5891 875.8249 889.7850 914.3012 920.9184 939.5020 960.0749 962.2876 976.2675 998.8914 1001.5137 1005.9542 1035.0612 1057.9267 1065.2670 1073.5888 1101.3201 1112.9149 1122.4519 1146.9473 1164.9981 1174.9978 1195.2339 1216.1266 1220.4080 1248.7116 1272.3303 1285.3696 1294.2666 1301.4751 1310.4928 1316.3120 1325.0289 1339.7940 1346.9604 1357.4489 1372.3498 1378.0603 1380.8046 1384.6483 1386.5615 1387.5225 1397.9933 1465.2030 1465.6760 1467.0969 1469.3512 1470.6869 1473.5045 1476.3001 1479.6283 1484.8519 1487.5380 1489.7610 1502.4808 2250.9088 2919.6171 2953.4759 2965.5739 2969.1200 2970.1578 2974.3200 2977.6445 2979.2253 2985.1163 2986.4085 2989.9704 3037.4661 3062.1646 3064.7539 3066.3795 3071.5469 3072.4369 3075.8555 3077.6529 3087.1152 3088.7372 3093.4596 3103.9182 3104.9044 3502.9773 3558.8106
redmass: 3.6993 3.4445 3.5012 3.0532 3.1082 2.7829 3.8280 4.2273 2.7788 1.1014 1.7303 1.7201 1.2130 1.4037 1.0441 1.2047 1.8675 2.2395 1.4389 2.0103 2.8802 2.8442 2.6468 2.5148 2.0292 1.8750 2.4779 2.5270 3.4865 3.3043 3.6914 2.4514 4.6395 2.8390 3.2024 3.3505 2.4425 2.9489 2.1531 2.4877 2.2631 1.2069 2.0805 2.9726 1.3835 1.3242 1.5436 1.9370 1.8914 1.3585 1.7000 2.0871 2.5671 1.6003 1.8425 2.2868 1.8649 2.0815 1.9476 1.9723 1.9375 1.3993 1.4433 1.3466 1.2522 1.4396 1.4033 1.5228 1.3342 1.4358 1.4756 1.4253 1.4159 1.3288 1.1741 1.2110 1.2313 1.2045 1.2082 1.2055 1.2035 1.0512 1.0484 1.0473 1.0473 1.0451 1.0492 1.0485 1.0522 1.0504 1.0454 1.0558 1.0474 11.8060 1.0812 1.0820 1.0792 1.0801 1.0379 1.0368 1.0380 1.0496 1.0541 1.0568 1.0360 1.0873 1.0994 1.0997 1.0986 1.0986 1.0982 1.0965 1.0963 1.0993 1.0978 1.0992 1.0986 1.1010 1.0652 1.0663
irintensity: 0.2594 0.1137 0.0138 0.1093 0.2023 0.2456 1.2063 0.5974 0.1121 0.0115 0.6419 0.2015 0.3512 1.4397 0.5468 1.0374 14.2265 5.3124 85.9709 42.4143 9.0513 16.5869 8.6677 2.6203 6.4492 64.5347 41.8280 5.0917 13.1399 6.4455 5.6716 5.9917 0.3374 13.4449 1.8441 6.0966 2.0878 5.4232 21.9761 9.5375 5.0908 5.1974 6.8291 84.7102 0.1942 26.4328 9.2001 15.0167 16.0422 30.2167 14.6030 9.5636 5.4753 20.4264 20.7936 10.6326 6.8665 5.0254 4.4098 1.4070 4.7158 15.5369 12.3521 0.2266 2.0924 1.7981 16.5534 13.8455 8.9290 6.8960 9.9671 3.5673 31.1390 7.6017 22.3133 18.9605 8.3502 0.8063 20.3072 37.9505 23.0983 5.8489 4.7581 3.0682 14.2809 13.4476 7.2085 11.4452 8.8288 11.7121 8.7566 5.0570 14.2774 10.0241 43.8398 51.2384 33.8500 15.5671 37.5800 13.1646 22.5953 3.4950 30.3009 64.5407 31.5245 16.0637 13.4160 24.1800 65.7719 73.2020 48.0310 78.6317 15.5910 36.6634 40.1878 26.7592 11.4330 17.9380 6.8007 6.9091
temp: 298.150 k
press: 1.00000 atm
elementType: 8 8 6 6 6 6 6 6 6 6 6 6 6 6 6 6 1 1 1 1 1 1 1 1 1 1 1 1 1 1 1 1 1 1 1 1 1 1 1 1 1 1
symmnumber: 1
zpe: 967734.6 jmol-1
zpe.correction: 0.368591 hartree
zpe.thermalcorrener: 0.389949 hartree
zpe.thermalcorrenthalpy: 0.390893 hartree
zpe.thermalcorrgfe: 0.317182 hartree
zpe.sumelectzpe: -698.151878 hartree
zpe.sumelectthermal: -698.130520 hartree
zpe.sumelectthermalent: -698.129576 hartree
zpe.sumelectthermalfe: -698.203287 hartree
dipole: 0.3700 -0.8741 -2.5834
dipole: 2.7522
quadrupole: -97.1339 -105.6137 -102.1789
quadrupole: 3.9589 -7.8539 0.3213
quadrupole: 4.5083 -3.9716 -0.5368 3.9589 -7.8539 0.3213
hfenergy: -698.5204689 hartree
pointgroup: C01 [X(C14H26O2)]
dipole: 0.2253751 -0.3107565 -1.0124799 debye
polarizability: 188.0183228|-3.7264475|155.5109909|1.5600543|1.3575905|135.2684148 unknown
InChI: InChI=1S/C14H26O2/c1-9(2)11(4)12(5)14(16)8-7-10(3)13(6)15/h9-16H,1-6H3
charge 0 multiplicity 1
42 atoms
O  -0.971231 3.015788 -0.880357
O  2.436476 -1.031059 1.735861
C  -1.907339 -0.429988 0.576021
C  -1.811656 1.122374 0.392232
C  -2.13635 -1.21972 -0.760613
C  -0.862776 1.537839 -0.772352
C  -2.96949 -0.777075 1.650206
C  -1.395745 1.842482 1.69657
C  -3.46056 -0.851645 -1.475074
C  -2.043865 -2.751949 -0.552294
C  0.53865 1.10118 -0.591061
C  3.104775 0.263351 -0.301263
C  3.099998 -1.129033 0.425566
C  1.715762 0.735445 -0.487017
C  3.954489 1.295753 0.487101
C  2.48744 -2.252649 -0.427573
H  -0.91869 -0.768042 0.964033
H  -2.810896 1.502881 0.094199
H  -1.299888 -0.953047 -1.440434
H  -1.239144 1.099484 -1.719959
H  -3.076535 -1.868786 1.771884
H  -2.693003 -0.36703 2.636284
H  -3.960918 -0.365001 1.382993
H  -2.177817 1.757626 2.469943
H  -0.459575 1.416346 2.106519
H  -1.227331 2.913271 1.496379
H  -4.336338 -1.115789 -0.853928
H  -3.525465 0.227482 -1.70726
H  -3.551762 -1.404813 -2.428427
H  -1.127685 -3.02876 0.003984
H  -2.912578 -3.145055 0.00686
H  -2.01823 -3.273014 -1.527768
H  3.565601 0.10868 -1.299388
H  -0.301444 3.329351 -1.540323
H  4.146217 -1.372971 0.684462
H  5.012383 0.9758 0.511423
H  3.902785 2.294999 0.021865
H  3.590091 1.367463 1.525761
H  2.48538 -3.196601 0.143919
H  1.445306 -2.011198 -0.710418
H  3.066239 -2.408697 -1.357225
H  1.497416 -0.742572 1.579971
