program: Gaussian 09
title: 000124846
version: EM64L-G09RevD.01
frameworkgroup: C1[X(C19H25F3N4O)]
method: RPBEPBE
basis: SDD
operation: Freq
keyword: #p
keyword: freq=noraman
keyword: PBEPBE/SDD
title: #p freq=noraman PBEPBE/SDD
converged: YES YES NO NO
title: Mulliken charges:
elementType: F F F O N N N N C C C C C C C C C C C C C C C C C C C H H H H H H H H H H H H H H H H H H H H H H H H H
charge: -0.170356 -0.169221 -0.167232 -0.242585 -0.302761 -0.462082 -0.414645 -0.074224 -0.045185 -0.431511 -0.347243 -0.365042 -0.718986 -0.351942 -0.567481 -0.521443 0.406923 0.211971 -0.467909 0.502700 -0.240651 -0.440727 -0.329601 0.297243 -0.322872 -0.339346 0.255537 0.197087 0.193443 0.197555 0.178045 0.224894 0.200408 0.240486 0.238601 0.225290 0.217843 0.206169 0.205550 0.195141 0.244927 0.212099 0.218637 0.226686 0.307912 0.301688 0.260996 0.254707 0.228936 0.316998 0.262447 0.262126
chargesum: 0.00000
title: Mulliken charges with hydrogens summed into heavy atoms:
elementType: F F F O N N N N C C C C C C C C C C C C C C C C C C C
charge: -0.170356 -0.169221 -0.167232 -0.242585 -0.064159 -0.154171 -0.112957 -0.074224 0.151902 -0.040513 0.055696 0.075852 -0.069684 0.048750 -0.110456 -0.076120 0.406923 0.211971 -0.206913 0.502700 0.014056 -0.211791 -0.012603 0.297243 -0.060425 -0.077219 0.255537
polarizability: 3.56762933e+02 -7.55617418e-01 1.76944589e+02 2.02503304e+00 -2.31530637e+01 2.05138844e+02
1716.lowfreq: -9.3154 -3.0396 -0.9825 -0.0015 -0.0011 0.0003 6.4149 8.4125 15.3214
frequency: 5.3028 8.2638 14.9699 19.4043 23.3559 28.9409 39.6752 57.5791 62.0981 72.5117 74.0390 88.7480 102.3884 120.7380 125.3815 141.3423 152.8025 174.5288 187.7356 206.4221 223.9138 239.8697 262.9582 284.7609 310.4016 328.7048 333.0815 368.2506 378.1310 379.2219 402.5921 409.3631 428.7317 469.4113 477.4602 515.3051 516.2838 557.8865 569.8772 615.4913 629.0315 632.7986 647.7295 653.8737 654.6225 659.0096 686.1670 730.4011 733.5785 738.0753 740.8117 770.4234 779.1181 783.3602 823.8371 831.2920 832.5555 858.0132 869.0468 887.8079 892.7136 919.0061 937.1750 956.1425 974.5729 976.7522 989.5358 996.4091 998.8461 1009.5388 1021.4106 1025.4977 1027.7521 1032.3319 1040.4785 1075.9279 1087.0324 1090.5667 1094.3208 1103.7887 1106.0504 1135.2775 1136.4873 1155.4881 1176.3517 1193.9201 1207.8846 1227.7007 1231.4547 1238.5337 1249.0550 1266.6418 1270.8654 1276.2180 1285.7160 1287.3932 1291.4182 1298.5263 1308.1121 1321.7244 1329.4976 1343.0122 1347.9118 1355.2761 1365.1242 1369.7870 1371.3781 1382.0536 1420.0942 1433.2137 1442.7991 1445.0046 1461.0923 1465.1931 1469.5012 1473.0058 1477.6444 1485.8779 1489.9771 1490.5453 1515.4574 1564.3200 1592.0468 1623.2435 1634.0845 2894.0148 2951.2821 2957.4102 2966.1259 2967.1893 2969.5623 2980.6074 2987.8183 2995.6057 3009.3367 3018.8684 3032.9289 3049.2084 3059.9696 3064.7578 3072.9007 3123.6822 3161.6074 3169.0563 3200.3241 3223.5534 3237.6642 3408.2051 3527.8962 3581.2330
redmass: 7.1823 6.4324 5.0324 8.5618 4.5486 5.2155 4.1665 4.3491 4.3440 3.0798 2.8664 3.7087 2.4221 3.5782 4.3962 2.7762 4.0508 2.6221 4.2481 4.0333 1.3339 4.9131 5.1363 5.2017 2.7220 4.7228 4.2818 4.7075 6.7874 7.5195 4.0130 3.0187 2.6011 2.4312 5.3451 3.6337 6.9952 4.1793 3.2870 5.5605 6.8086 2.2170 1.9562 1.1985 1.6698 2.2997 7.8158 1.5635 2.5484 3.2522 2.6195 1.4127 1.3412 1.2257 1.4624 4.2052 1.4489 1.9568 1.4337 1.4978 5.5252 2.2683 3.7176 1.4695 7.0126 2.4294 5.8628 1.9150 1.4122 3.4932 7.1986 2.1624 2.1409 3.5294 3.3521 2.4743 1.7800 2.0990 2.0475 2.1758 2.0872 1.6533 1.3713 2.2120 2.2151 1.1292 1.7440 1.7669 1.3778 1.5062 1.4256 1.7007 1.3612 1.2574 1.1721 4.6349 1.2886 1.1980 1.4108 1.4477 1.2835 2.1370 1.5293 1.6520 3.9384 1.4309 3.8799 1.2229 4.3782 2.8799 1.1531 1.1345 1.0867 1.0960 1.0725 1.0766 1.0700 1.1007 1.9916 1.1007 3.0372 4.8252 6.3410 4.8371 5.9425 1.0684 1.0652 1.0687 1.0664 1.0591 1.0434 1.0643 1.0605 1.0901 1.0932 1.0975 1.1006 1.1016 1.1028 1.0993 1.0992 1.0901 1.0913 1.0952 1.0953 1.0976 1.0997 1.0736 1.0762 1.0817
irintensity: 0.0900 1.9668 0.7692 0.6173 3.6451 2.9851 3.2525 0.1433 1.9186 1.9070 0.8955 3.5074 2.0316 0.1217 0.4432 0.6141 4.0668 1.2282 4.8531 1.1492 1.0073 0.1040 1.3149 7.6088 0.7504 0.6142 9.4060 16.6691 3.1556 1.8720 4.0267 0.0672 3.1768 7.6983 5.9766 1.9493 1.3203 6.1287 23.6939 9.7310 1.3855 35.3941 17.5994 32.8470 181.3557 1.4944 1.8242 11.5236 9.9786 8.1225 2.6672 34.3886 0.4443 2.3683 33.8341 0.4059 58.8276 7.5510 84.1941 2.4111 13.8801 0.8381 10.5345 17.7706 228.3150 17.4493 113.2103 10.2737 20.1537 3.4299 171.6020 45.9045 48.9959 5.0151 3.3688 7.2068 27.9586 10.5192 12.8918 14.9973 9.1153 27.8464 5.5557 90.3366 73.6874 54.0202 12.1427 17.5375 18.5377 5.4183 19.9194 6.4901 0.2752 27.5919 13.3068 498.9512 1.9181 1.4321 63.6085 18.9510 19.4032 9.5964 8.2595 1.7616 8.6383 17.9072 225.9674 19.2277 27.5051 23.8618 43.9295 1.3244 4.1684 6.7651 1.9480 0.9019 12.2043 20.9284 252.8859 10.7204 156.0476 15.0368 63.1489 109.0852 113.0704 79.4892 2.4764 7.7285 25.5780 20.1667 50.6921 46.1864 33.7909 23.1736 7.8684 16.2977 13.7273 29.9526 43.0641 76.4342 51.4922 12.9533 1.9454 2.1071 7.7184 7.0850 1.3166 1.2316 12.6920 24.5368
temp: 298.150 k
press: 1.00000 atm
elementType: 9 9 9 8 7 7 7 7 6 6 6 6 6 6 6 6 6 6 6 6 6 6 6 6 6 6 6 1 1 1 1 1 1 1 1 1 1 1 1 1 1 1 1 1 1 1 1 1 1 1 1 1
symmnumber: 1
zpe: 1098124.3 jmol-1
zpe.correction: 0.418253 hartree
zpe.thermalcorrener: 0.446072 hartree
zpe.thermalcorrenthalpy: 0.447016 hartree
zpe.thermalcorrgfe: 0.351004 hartree
zpe.sumelectzpe: -1330.759514 hartree
zpe.sumelectthermal: -1330.731696 hartree
zpe.sumelectthermalent: -1330.730752 hartree
zpe.sumelectthermalfe: -1330.826764 hartree
dipole: -2.2276 0.6873 5.6093
dipole: 6.0744
quadrupole: -279.5140 -161.7586 -148.3721
quadrupole: -11.7204 -6.5296 -10.5970
quadrupole: -82.9657 34.7896 48.1762 -11.7204 -6.5296 -10.5970
hfenergy: -1331.1777679 hartree
pointgroup: C01 [X(C19H25F3N4O1)]
dipole: -0.8838816 0.106328 -2.2178622 debye
polarizability: 356.7050608|2.9901718|185.7497086|-2.0057675|-26.6040686|196.3915959 unknown
InChI: InChI=1S/C19H25F3N4O/c1-14(24-11-10-17-12-23-13-25-17)4-2-3-5-18(27)26-16-8-6-15(7-9-16)19(20,21)22/h6-9,12-14,24-26H,2-5,10-11H2,1H3
charge 0 multiplicity 1
52 atoms
F  9.249959 0.753595 -0.841657
F  8.86498 1.787065 1.135019
F  9.053724 -0.467046 1.068148
O  2.028832 -0.855353 1.347758
N  -4.852675 -1.137325 0.249234
N  2.841442 0.335134 -0.505962
N  -8.175201 2.029837 -0.266957
N  -10.080894 1.838147 0.93095
C  -4.303486 -2.069963 -0.772521
C  -2.802395 -2.319153 -0.480635
C  -1.929324 -1.051256 -0.588951
C  -0.461379 -1.304682 -0.184612
C  -5.076106 -3.413491 -0.881157
C  -6.198464 -0.58562 -0.006268
C  0.409121 -0.031257 -0.302022
C  -6.508746 0.55541 1.001381
C  -7.863877 1.177421 0.809327
C  1.817185 -0.236297 0.265633
C  -9.059621 1.078442 1.5299
C  4.236179 0.368698 -0.249467
C  -9.513598 2.401058 -0.151947
C  5.060753 1.04134 -1.194748
C  4.830204 -0.238218 0.892008
C  7.038225 0.514885 0.132504
C  6.449644 1.116941 -1.005294
C  6.22305 -0.156975 1.073221
C  8.511808 0.636195 0.363737
H  -4.381979 -1.543299 -1.74745
H  -2.704143 -2.749921 0.539331
H  -2.429421 -3.093682 -1.180711
H  -1.971207 -0.669117 -1.631277
H  -2.373839 -0.26542 0.052152
H  -0.02688 -2.107319 -0.814258
H  -0.409369 -1.662902 0.860605
H  -4.785499 -1.54749 1.193478
H  -6.152495 -3.24817 -1.069817
H  -4.680604 -4.033932 -1.707119
H  -4.977388 -3.994771 0.056244
H  -7.023348 -1.335598 0.047377
H  -6.205693 -0.182095 -1.038946
H  -0.069372 0.779424 0.284961
H  0.444278 0.314645 -1.354543
H  -6.46301 0.14649 2.028586
H  -5.697717 1.305938 0.927052
H  2.540652 0.800538 -1.365748
H  -7.524634 2.329306 -0.992528
H  -9.244842 0.511985 2.440277
H  -10.012162 3.064233 -0.8550
H  4.611462 1.506526 -2.080813
H  4.19639 -0.758892 1.610884
H  7.076405 1.630585 -1.740274
H  6.678873 -0.629797 1.948713
