program: Gaussian 09
title: 000124652
version: EM64L-G09RevD.01
frameworkgroup: C1[X(C10H9ClN2O3S)]
method: RPBEPBE
basis: SDD
operation: Freq
keyword: #p
keyword: freq=noraman
keyword: PBEPBE/SDD
title: #p freq=noraman PBEPBE/SDD
converged: YES YES NO NO
title: Mulliken charges:
elementType: Cl S O O O N N C C C C C C C C C C H H H H H H H H H
charge: -0.027201 0.335733 -0.241384 -0.430164 -0.242034 -0.110579 -0.096870 -0.387304 -0.248547 -0.062828 -0.156129 -0.203684 -0.068192 -0.219290 -0.156737 -0.323118 0.202213 0.255936 0.221012 0.236569 0.240429 0.277884 0.255729 0.303464 0.253926 0.391168
chargesum: 0.00000
title: Mulliken charges with hydrogens summed into heavy atoms:
elementType: Cl S O O O N N C C C C C C C C C C
charge: -0.027201 0.335733 -0.241384 -0.038997 -0.242034 -0.110579 -0.096870 0.089645 0.228451 -0.062828 0.121754 0.052045 -0.068192 -0.219290 0.146727 -0.069192 0.202213
polarizability: 2.05786711e+02 -1.21605450e+01 1.84761050e+02 -4.01653531e+00 7.20094811e+00 8.43184589e+01
1716.lowfreq: -5.2868 -0.0018 -0.0011 -0.0007 2.0183 6.2994 12.7412 22.2424 41.6989
frequency: 11.5520 21.9603 41.6935 54.7081 73.6828 88.6945 125.1839 142.8747 147.3505 175.0939 203.8961 223.3219 319.5820 329.6918 339.6543 351.6134 395.3944 433.9482 462.1881 503.4421 562.0016 585.2649 607.0273 618.5353 648.7697 655.5641 678.4800 702.6234 709.1462 734.2118 772.4589 805.7028 823.6085 849.7651 878.8653 879.6910 955.9173 960.8320 975.2709 1017.3726 1056.5755 1075.6552 1091.4603 1108.7953 1141.7941 1177.3678 1192.9562 1221.8762 1226.8148 1268.9915 1302.5277 1334.8744 1343.7220 1355.8038 1367.5630 1374.8609 1433.2176 1458.6096 1466.0089 1480.2494 1491.4987 1540.3461 1643.2734 3004.7634 3016.6899 3075.8178 3083.4012 3207.0784 3224.2233 3229.6839 3260.6932 3535.6276
redmass: 7.0918 5.9927 4.7046 6.5754 12.3872 8.5239 9.9349 4.2492 4.0640 10.5790 5.9501 8.3207 12.9709 5.2860 2.6026 6.1339 22.9406 5.3078 4.1669 3.5713 1.3232 4.4045 4.9812 3.6822 3.2775 3.0925 5.1752 6.4725 6.8641 1.2992 1.3379 10.7643 5.1649 1.4054 6.3580 1.4077 2.3820 5.8749 2.8932 2.7715 1.6959 2.3436 2.1055 1.7948 2.7509 1.3035 1.9233 1.8248 1.2134 1.8730 4.0149 2.5873 4.7637 2.0653 1.6497 1.6572 1.8138 1.2565 1.5584 2.8393 5.3467 7.9473 8.6753 1.0564 1.0615 1.1030 1.1092 1.0965 1.0969 1.0928 1.1085 1.0644
irintensity: 1.8439 0.5476 1.5591 6.0374 1.1112 1.1439 3.4869 0.8825 2.9945 1.8729 0.9557 2.5366 2.6146 0.8039 1.5644 4.7427 2.8579 0.7492 19.9998 31.5017 104.9273 40.1048 21.9677 31.0311 0.1470 22.3767 6.5496 36.5012 23.6839 13.7993 100.1200 35.6514 87.4931 0.3605 11.2489 19.5224 36.5840 193.6607 15.9534 39.4529 30.3412 19.3881 339.6963 19.8807 11.0618 7.2242 87.3785 19.4436 8.7025 38.5335 15.1766 0.7989 77.3294 41.4956 42.5867 14.9040 45.8988 29.7224 53.2769 19.0540 300.4880 64.4112 325.9685 21.5911 22.7083 9.0138 17.4760 4.3435 2.7722 3.0263 1.2566 67.9299
temp: 298.150 k
press: 1.00000 atm
elementType: 17 16 8 8 8 7 7 6 6 6 6 6 6 6 6 6 6 1 1 1 1 1 1 1 1 1
symmnumber: 1
zpe: 470488.0 jmol-1
zpe.correction: 0.179199 hartree
zpe.thermalcorrener: 0.195559 hartree
zpe.thermalcorrenthalpy: 0.196503 hartree
zpe.thermalcorrgfe: 0.131043 hartree
zpe.sumelectzpe: -1578.475305 hartree
zpe.sumelectthermal: -1578.458945 hartree
zpe.sumelectthermalent: -1578.458001 hartree
zpe.sumelectthermalfe: -1578.523462 hartree
dipole: 2.2597 4.9773 0.5136
dipole: 5.4904
quadrupole: -120.6835 -119.4872 -112.2595
quadrupole: -15.6651 4.4391 5.6880
quadrupole: -3.2068 -2.0105 5.2173 -15.6651 4.4391 5.6880
hfenergy: -1578.6545042 hartree
pointgroup: C01 [X(C10H9Cl1N2O3S1)]
dipole: -0.8663915 -1.9561258 0.2980925 debye
dipolederiv: -0.1295881 0.0778855 0.0033726 0.0750357 -0.6779953 0.0184242 -0.0158176 0.0415018 -0.0194352 -0.0024921 -0.0806124 0.0192452 0.0612189 -0.212076 0.0407373 -0.0193284 0.0474282 0.1636837 -1.9380026 0.3749334 -0.126902 0.5469489 -0.4264629 0.0113709 -0.0165669 -0.0008533 -0.2750769 -1.4547033 -0.1075533 0.1314061 -0.3621347 -0.3151929 0.0371653 0.195917 0.0008518 -0.450303 -0.7234181 0.1944859 0.0213904 0.2741741 -1.1131147 0.0804571 0.0264524 0.0673357 -0.3354327 -0.3846004 -0.2619829 0.0414185 -0.4555806 -0.6527839 -0.0216531 0.1100205 -0.007822 -0.0723322 -0.3834649 -0.1074824 -0.0112389 -0.2581647 -0.4708419 -0.0168049 -0.0017828 0.0068131 -0.2531372 0.3228159 0.1671288 -0.0539449 0.369784 0.5318367 0.0143608 -0.1313711 0.003321 0.1897417 0.7453308 -0.1651518 0.168515 -0.4380761 0.2873754 -0.0515308 0.5376486 -0.0987552 0.375632 1.6528982 -0.265936 0.0089634 -0.0770363 0.2729512 -0.0257269 -0.3739323 0.0822438 -0.0679823 -0.152977 0.0154929 0.0265952 0.2514647 0.1849721 -0.0246159 -0.1125918 -0.1672518 -0.1445184 0.2912279 0.310622 0.1482325 0.3134074 0.2885124 0.0389657 0.2771898 0.1065011 -0.0099481 -0.5973518 -0.020413 0.0053269 -0.2908372 0.9430005 -0.0142 0.1802296 -0.0973445 -0.098376 -0.4488026 0.5625832 -0.0506162 0.9275907 -0.4685398 -0.0635039 -0.0653498 -0.052265 -0.1415899 0.2295272 -0.1784947 -0.0236557 -0.4185778 -0.0738538 0.0436403 0.0012067 0.0314242 -0.0386054 -0.1314173 0.0342227 0.0933452 -0.0074363 0.097938 -0.152945 0.0780531 -0.1039984 -0.0133883 2.1611674 -0.4582028 -0.1693223 -0.4899135 1.4830725 -0.1201395 -0.2311187 -0.0716671 0.3063238 0.0825543 -0.0658635 0.0045211 -0.0947974 -0.0053965 -0.0288796 0.0221206 -0.1112119 -0.045161 -0.0397788 0.0540339 -0.0652101 -0.0315801 0.0135504 0.042714 -0.0492417 0.1155469 0.031352 -0.0005718 -0.0888548 0.0075602 0.0202611 -0.0789298 0.0690679 -0.0582738 0.0343202 0.04899 0.0011534 0.053897 0.0042849 0.07756 0.0112313 -0.0974425 -0.1198278 -0.0255406 -0.0615015 0.1364072 -0.0139996 -0.1184059 -0.0286063 0.108013 -0.0093666 -0.1380477 0.0108979 0.1226793 0.1522478 -0.0095853 -0.0546579 0.0067254 0.0214093 0.0988434 -0.0632517 0.078589 0.0895554 0.0933899 -0.0215806 0.0156132 -0.061141 0.1073267 0.0167065 0.0164793 0.0138808 0.1905024 0.145551 -0.0261744 -0.0305119 -0.0183103 -0.0059399 0.0986271 -0.0421456 0.0705411 0.106853 0.3728979 0.0266022 0.0046753 0.1080213 0.1499381 0.0157283 -0.0066702 0.0255132 0.4014747 unknown
polarizability: 205.9040282|-11.3410494|183.2627641|7.1397449|-13.054816|85.6994273 unknown
InChI: InChI=1S/C10H9ClN2O3S/c11-7-5-8(9(14)15)17-10(7)16-4-3-13-2-1-12-6-13/h1-2,5-6,14H,3-4H2
charge 0 multiplicity 1
26 atoms
Cl -1.483307 -3.369491 0.033515
S  -1.386135 1.023414 -0.365385
O  0.593157 -0.879392 -0.549275
O  -5.382096 0.656692 0.246352
O  -4.095994 2.561079 -0.171787
N  3.510392 -0.172107 0.043463
N  4.906486 1.528315 0.608863
C  2.858835 -1.486682 0.079143
C  1.411624 -1.451253 0.5738
C  -0.7420 -0.673766 -0.309139
C  3.227879 0.886914 -0.834409
C  4.530467 0.267513 0.892909
C  -1.765855 -1.585875 -0.055886
C  -3.046577 0.380355 -0.054149
C  -3.061108 -1.003789 0.090423
C  4.094291 1.920229 -0.470213
C  -4.16749 1.317623 -0.009518
H  2.876844 -1.945744 -0.92602
H  3.44239 -2.137359 0.755205
H  1.048157 -2.472336 0.789964
H  1.293664 -0.803945 1.461863
H  2.459459 0.808419 -1.597943
H  4.956315 -0.360444 1.673234
H  -3.975543 -1.568828 0.276783
H  4.185439 2.909999 -0.911189
H  -6.110794 1.33316 0.268996
