program: Gaussian 09
title: 000124675
version: EM64L-G09RevD.01
frameworkgroup: C1[X(C18H24N2O4)]
method: RPBEPBE
basis: SDD
operation: Freq
keyword: #p
keyword: freq=noraman
keyword: PBEPBE/SDD
title: #p freq=noraman PBEPBE/SDD
converged: YES YES NO NO
title: Mulliken charges:
elementType: O O O O N N C C C C C C C C C C C C C C C C C C H H H H H H H H H H H H H H H H H H H H H H H H
charge: -0.281214 -0.186570 -0.293866 -0.313409 -0.174593 -0.386520 -0.097092 -0.490303 -0.387732 -0.481479 -0.163095 0.192580 -0.086160 -0.086832 -0.703202 -0.708065 0.292580 -0.422671 0.474460 -0.382101 -0.386775 -0.224811 -0.223963 -0.231180 0.296167 0.262313 0.231475 0.228414 0.291287 0.237709 0.239268 0.258225 0.229748 0.209843 0.332871 0.218797 0.231335 0.207097 0.221540 0.238017 0.199668 0.235027 0.226096 0.234238 0.234420 0.228898 0.228509 0.231051
chargesum: 0.00000
title: Mulliken charges with hydrogens summed into heavy atoms:
elementType: O O O O N N C C C C C C C C C C C C C C C C C C
charge: -0.281214 -0.186570 -0.293866 -0.313409 -0.174593 -0.053649 0.199074 0.003485 0.131969 -0.004502 0.095130 0.192580 0.143588 0.123011 -0.045973 -0.048840 0.292580 0.038452 0.474460 -0.147863 -0.152355 0.004087 0.004546 -0.000129
polarizability: 2.76688025e+02 1.34675180e+01 2.03031645e+02 -1.42145231e+01 7.05866930e+00 1.75882209e+02
1716.lowfreq: -22.7293 -10.8544 -5.2898 -3.1070 -0.0009 -0.0008 -0.0006 8.4356 22.6236
frequency: -20.7390 -10.3674 22.4275 23.0506 36.6316 45.5421 54.3276 58.7055 71.8967 80.9954 100.6666 120.5056 142.9475 162.7266 169.2120 181.1989 184.4747 208.7366 223.2794 231.8426 255.8435 290.0873 295.6925 299.5071 317.2282 337.5869 396.2229 403.1344 406.2962 414.9688 476.2140 496.2135 547.5437 556.5920 572.0748 590.0007 617.0183 653.5766 678.3676 695.4705 703.0633 709.0724 724.2814 758.7269 783.9971 820.7737 834.9809 848.0005 853.3022 867.8776 885.1513 896.9947 920.2800 923.8092 930.8179 936.7724 948.2976 955.5217 969.4334 972.6099 977.2975 991.2256 994.5488 997.8749 1007.9608 1026.6330 1073.6999 1087.9863 1099.2964 1106.3844 1132.1982 1140.3950 1151.6084 1170.4833 1173.1674 1174.5914 1182.2239 1186.7659 1191.2086 1204.5995 1227.0437 1239.2746 1254.1144 1265.2439 1301.3787 1308.6322 1310.2538 1318.7990 1322.7825 1324.6308 1332.2523 1346.1260 1353.9478 1364.8263 1379.1775 1386.0061 1391.1358 1396.9674 1439.3628 1461.2535 1465.3266 1468.0171 1474.4100 1477.1285 1479.5814 1484.3573 1486.5149 1488.4769 1501.3116 1572.4216 1596.3099 1617.5507 1636.3792 1639.2550 2917.3029 2972.1734 2976.3697 2985.0590 2989.9675 2994.3617 3012.2551 3019.0665 3027.4609 3054.9695 3062.5142 3064.0216 3072.9069 3076.3045 3080.4537 3084.6355 3088.5765 3102.5306 3122.2147 3124.5208 3136.5642 3149.0942 3165.1099 3555.8764
redmass: 4.1737 3.7683 5.4490 5.1824 4.0512 4.0213 3.6501 8.3868 3.5389 4.7235 4.1448 5.2121 5.0099 4.2530 2.5210 2.6999 1.1528 1.2401 3.2906 3.6197 3.5144 5.0598 3.7093 4.0805 2.2457 3.5618 3.2478 2.7930 3.1063 2.9449 3.6914 3.9153 3.6422 4.3705 2.5909 1.4300 6.3357 2.8938 6.0663 10.2690 1.7768 5.5136 4.5570 1.9955 3.4601 3.3647 3.0102 2.6950 1.2475 1.9150 3.1589 2.0571 2.1639 1.1983 1.6816 1.9960 1.6675 1.4719 2.9479 2.3439 1.3938 6.0137 2.6135 1.3330 2.1147 2.1734 1.5047 1.5148 1.9601 4.4178 2.3458 3.3077 2.5405 1.4056 1.0557 1.7520 1.6324 1.1235 1.1048 2.2738 2.3842 1.2280 1.5049 1.6319 1.4396 1.3316 1.3511 1.5166 1.3514 1.2769 1.4133 1.3876 1.4410 1.2390 1.2128 8.7329 3.9040 1.2121 2.1852 1.0881 1.0522 1.0480 1.1715 1.0905 1.2728 1.3781 1.0534 2.2811 1.0892 7.0575 6.1321 6.2163 9.5997 8.9234 1.0872 1.0376 1.0399 1.0791 1.0796 1.0601 1.0580 1.0653 1.0633 1.1050 1.0873 1.0977 1.0961 1.1076 1.0997 1.0990 1.1018 1.1051 1.0852 1.0883 1.0921 1.0964 1.1017 1.0772
irintensity: 0.0426 0.0528 1.8651 0.8131 0.8235 0.3557 1.7108 11.6401 1.9368 4.6035 2.8937 1.4701 1.3440 1.2168 2.9992 3.7784 0.1514 2.1350 0.5159 22.3290 2.6503 8.5981 10.4007 9.3253 0.6478 1.9223 4.0283 0.0084 2.5803 9.9926 17.5623 8.8228 0.9164 18.9639 15.8209 112.4375 0.1567 8.9567 8.3170 8.8338 55.9033 11.2239 24.6131 56.0137 14.2678 2.6145 42.7011 7.9028 0.0100 1.9166 34.9271 6.3261 12.5469 13.7136 4.4105 5.8954 9.1886 2.4031 160.1119 113.5871 0.0980 0.6117 2.8355 0.0194 15.8233 2.3358 2.6781 7.4304 11.4225 75.2510 2.7406 15.7692 34.0791 11.0436 0.2122 51.7161 1.5829 5.5067 4.8762 327.2947 12.3358 4.3606 36.8658 44.0640 4.7683 16.4352 50.7204 10.6380 8.4918 0.3478 17.0379 20.2928 29.9774 0.6391 5.5059 0.9163 132.5437 12.0442 9.3050 15.0487 2.0305 4.9674 85.8730 16.9862 126.4332 141.4816 24.8044 86.8555 6.3624 225.5282 0.8133 0.2836 234.0939 199.2336 66.0455 25.8172 23.9204 11.3345 13.5080 12.2409 23.1347 30.7480 24.4951 11.2188 8.3706 6.5078 66.7361 13.5302 29.9301 46.3653 17.3326 16.9579 4.8491 1.9378 15.4266 39.4763 20.9322 37.6887
temp: 298.150 k
press: 1.00000 atm
elementType: 8 8 8 8 7 7 6 6 6 6 6 6 6 6 6 6 6 6 6 6 6 6 6 6 1 1 1 1 1 1 1 1 1 1 1 1 1 1 1 1 1 1 1 1 1 1 1 1
symmnumber: 1
zpe: 1032839.5 jmol-1
zpe.correction: 0.393388 hartree
zpe.thermalcorrener: 0.416538 hartree
zpe.thermalcorrenthalpy: 0.417482 hartree
zpe.thermalcorrgfe: 0.338274 hartree
zpe.sumelectzpe: -1108.919051 hartree
zpe.sumelectthermal: -1108.895901 hartree
zpe.sumelectthermalent: -1108.894957 hartree
zpe.sumelectthermalfe: -1108.974165 hartree
dipole: 2.9215 0.6572 1.8789
dipole: 3.5352
quadrupole: -148.5289 -132.0439 -148.3467
quadrupole: -6.8905 -13.2442 1.7564
quadrupole: -5.5557 10.9293 -5.3736 -6.8905 -13.2442 1.7564
hfenergy: -1109.3124388 hartree
pointgroup: C01 [X(C18H24N2O4)]
dipole: -1.1610241 -0.3655831 0.6729275 debye
polarizability: 276.2994832|10.7804298|204.4463895|17.6134037|-2.4406629|174.856006 unknown
InChI: InChI=1S/C18H24N2O4/c1-13(2)16(17(22)20-10-6-9-15(20)11-21)19-18(23)24-12-14-7-4-3-5-8-14/h3-5,7-8,11,13,15-16,19H,6,9-10,12H2,1-2H3
charge 0 multiplicity 1
48 atoms
O  2.296294 -0.113446 -1.92784
O  6.20136 1.771352 -0.569985
O  -2.048659 -0.21185 0.108968
O  -0.4017 -0.213277 1.801397
N  3.00935 0.434677 0.211769
N  -0.008809 -1.113675 -0.335387
C  3.750211 1.6328 -0.27944
C  3.834111 2.554009 0.953016
C  2.981831 0.377702 1.709019
C  3.895699 1.553991 2.139015
C  1.400286 -1.470563 -0.094732
C  2.283475 -0.335749 -0.669881
C  1.762353 -2.8324 -0.756035
C  5.122132 1.186126 -0.817007
C  0.859237 -3.965871 -0.221011
C  3.256176 -3.162599 -0.526409
C  -0.771364 -0.490923 0.624954
C  -2.970812 0.489196 1.065186
C  -4.325641 0.572584 0.407189
C  -4.668365 1.689678 -0.395316
C  -5.274284 -0.466782 0.579854
C  -5.933925 1.766505 -1.018133
C  -6.540906 -0.39391 -0.0411
C  -6.873272 0.723837 -0.841962
H  3.194289 2.064518 -1.136399
H  4.725061 3.200973 0.903727
H  2.931419 3.186551 1.016368
H  3.366213 -0.591606 2.07453
H  1.942796 0.49939 2.066407
H  3.559394 1.999404 3.08947
H  4.934684 1.204078 2.274916
H  1.520712 -1.553953 0.99813
H  1.602494 -2.716553 -1.847946
H  5.082115 0.27458 -1.461188
H  -0.36933 -1.15794 -1.290654
H  1.078679 -4.91273 -0.747215
H  -0.211966 -3.736945 -0.35913
H  1.033249 -4.131933 0.859629
H  3.50572 -4.135561 -0.986189
H  3.918785 -2.401337 -0.975241
H  3.486494 -3.235342 0.554641
H  -2.990552 -0.088203 2.006061
H  -2.544845 1.486499 1.276224
H  -3.939997 2.4976 -0.535332
H  -5.0173 -1.334558 1.199369
H  -6.187914 2.634934 -1.635922
H  -7.266897 -1.202205 0.100384
H  -7.856581 0.783027 -1.321968
