program: Gaussian 09
title: 000124903
version: EM64L-G09RevD.01
frameworkgroup: C1[X(C14H25NO11)]
method: RPBEPBE
basis: SDD
operation: Freq
keyword: #p
keyword: freq=noraman
keyword: PBEPBE/SDD
title: #p freq=noraman PBEPBE/SDD
converged: YES YES NO NO
title: Mulliken charges:
elementType: O O O O O O O O O O O N C C C C C C C C C C C C C C H H H H H H H H H H H H H H H H H H H H H H H H H
charge: -0.383100 -0.274702 -0.419426 -0.448391 -0.435170 -0.494571 -0.461763 -0.458653 -0.494973 -0.331833 -0.198825 -0.372860 -0.062389 -0.213593 0.026279 -0.177367 -0.047547 -0.000465 -0.372580 -0.090727 -0.182147 -0.158458 -0.361472 0.292544 -0.772013 -0.060504 0.283814 0.231018 0.213668 0.267366 0.238254 0.260869 0.323335 0.208839 0.228613 0.213466 0.260917 0.365959 0.358514 0.233464 0.224920 0.195173 0.363738 0.400875 0.361173 0.260025 0.269059 0.216578 0.193952 0.370912 0.410205
chargesum: 0.00000
title: Mulliken charges with hydrogens summed into heavy atoms:
elementType: O O O O O O O O O O O N C C C C C C C C C C C C C C
charge: -0.383100 -0.274702 -0.053467 -0.089877 -0.071432 -0.093697 -0.100590 -0.087741 -0.084767 -0.331833 -0.198825 -0.049526 0.221425 0.017425 0.239947 0.089999 0.190707 0.260404 0.064872 0.122740 0.078770 0.075006 0.058621 0.292544 -0.026351 0.133448
polarizability: 2.23959725e+02 -7.67756080e+00 2.13713164e+02 6.75994446e+00 6.11920386e+00 1.55499849e+02
1716.lowfreq: -10.4106 -7.3885 -4.2746 0.0007 0.0009 0.0009 7.2608 27.4348 36.7328
frequency: -7.5160 27.2158 36.6684 49.8903 52.7368 63.9483 68.8656 82.8280 87.7915 96.9475 100.7208 115.9520 121.6847 135.0043 156.2115 161.5138 169.2292 182.2104 188.4519 208.2035 241.7309 242.6684 247.2821 274.7665 278.3257 289.8904 299.1918 303.2842 315.1617 322.5258 347.7964 383.2042 404.7700 427.7805 436.2979 445.2976 459.0472 467.8739 470.7336 506.0547 535.9931 545.7019 552.0668 564.0990 572.3404 594.4773 608.5940 624.0034 673.5341 689.5934 702.5254 710.9425 722.7385 756.8170 798.8053 810.1444 825.5589 832.8921 850.7973 875.7193 879.2014 898.1948 916.9054 955.6358 961.6195 964.1925 972.0466 992.5938 993.5541 998.1329 1008.7052 1028.9205 1040.9206 1044.8728 1052.0218 1061.7734 1076.7612 1083.4163 1094.6193 1101.5362 1115.5219 1122.6934 1145.8839 1182.4166 1191.8411 1198.3066 1200.1755 1209.4830 1211.2645 1235.8984 1242.9153 1258.8919 1263.0777 1271.7237 1285.7690 1291.5502 1305.7847 1308.9215 1322.6494 1329.0203 1337.8257 1340.1251 1341.9234 1345.0284 1352.0583 1360.6842 1364.7586 1366.4370 1370.0383 1376.5381 1384.1990 1391.1260 1395.0665 1413.3845 1449.3734 1456.8907 1459.8170 1468.0838 1485.0488 1497.3638 1601.7067 1626.6719 2938.6524 2940.5949 2949.7675 2965.9241 2972.8059 2985.8433 2998.6831 2998.9467 2999.9297 3021.5012 3026.6308 3031.3752 3065.7248 3079.5351 3080.8276 3098.0400 3105.3328 3169.9954 3248.8797 3315.3075 3424.9042 3479.2793 3485.8013 3506.0931 3540.6284
redmass: 5.0970 5.8628 6.2691 5.3963 4.7238 5.2599 7.0047 4.9329 4.8967 6.2456 5.6226 1.2511 5.8019 4.6908 3.6764 4.0231 3.5173 5.3591 4.0297 5.9030 5.0111 4.9364 4.8693 4.1195 5.6598 5.5278 5.5650 5.3588 5.2628 6.4759 5.6032 4.5661 3.7485 1.3374 3.2987 1.4580 1.6065 2.3958 2.2343 3.3193 2.0230 1.6000 1.1906 2.6363 3.4751 1.2874 2.9033 3.9345 3.2680 3.9352 2.4178 4.1520 1.5082 3.8904 2.9440 4.1171 1.2211 4.0442 3.0422 4.5707 4.1698 2.2098 4.0953 2.9516 2.9037 3.6296 2.5078 3.2118 1.7703 4.7001 3.9545 4.1090 2.8767 1.9879 2.5948 3.4098 2.8156 2.7436 3.6394 3.1966 2.6845 2.9151 2.7859 1.0881 1.2717 1.4211 1.2660 1.3828 1.4995 1.3003 1.2348 1.5328 1.3051 1.2436 1.4492 1.3110 1.4819 1.4037 1.2953 1.2171 1.3456 1.2823 1.1997 1.2455 1.2122 1.1527 1.2862 1.2333 1.3383 1.2659 1.2447 1.2268 1.3158 1.2473 1.0477 1.0888 1.0889 1.1128 1.1875 1.9997 5.0975 8.4524 1.0806 1.0842 1.0844 1.0885 1.0791 1.0704 1.0370 1.0612 1.0842 1.0850 1.0841 1.0853 1.0874 1.1030 1.0975 1.0979 1.1012 1.0688 1.0714 1.0642 1.0647 1.0676 1.0650 1.0651 1.0780
irintensity: 0.1045 1.0456 2.1495 3.3638 1.9155 15.0899 1.6057 10.5775 1.8898 1.9243 3.9992 2.8155 3.5011 1.3272 4.4819 1.8874 3.6080 5.1999 1.9963 19.7404 10.4615 16.7164 3.1385 0.9350 9.1046 1.1860 15.7757 1.4163 21.5369 5.2041 1.0616 32.5018 30.6050 113.4780 18.6859 51.7115 18.2217 14.9480 56.1164 7.2323 26.1459 125.0332 159.4833 27.8336 12.4789 35.1931 6.9452 13.7294 18.9402 10.7971 124.2803 5.7315 114.7954 6.1671 29.2456 36.1842 297.6268 56.3947 27.3757 145.2362 31.8099 49.6221 53.8382 21.0644 27.6780 44.1635 24.9567 60.4620 45.0907 14.9935 60.2884 115.7931 11.0719 58.6476 29.8940 8.5817 102.3753 11.4038 4.8438 53.5241 30.2007 27.1419 17.8070 23.6779 25.3878 30.5111 48.3304 59.8378 31.7758 32.7308 20.4551 0.7345 20.0324 7.9108 30.0872 7.4283 7.7022 19.4918 2.5956 28.3446 0.7224 58.6032 43.7411 13.6258 60.4159 37.7519 3.9741 18.0416 18.1374 18.0784 44.9876 82.5245 3.9058 64.0655 19.0859 9.8114 3.8859 64.1231 52.5521 229.6594 180.9195 135.1423 4.7103 23.6545 29.7795 107.8645 5.7165 39.1344 13.1704 38.8520 31.6629 43.9159 16.1757 11.1579 13.1200 59.3245 29.3720 4.7835 16.2516 623.5329 593.8245 74.5842 46.4730 112.8305 28.7565 10.6684 26.3832
temp: 298.150 k
press: 1.00000 atm
elementType: 8 8 8 8 8 8 8 8 8 8 8 7 6 6 6 6 6 6 6 6 6 6 6 6 6 6 1 1 1 1 1 1 1 1 1 1 1 1 1 1 1 1 1 1 1 1 1 1 1 1 1
symmnumber: 1
zpe: 1061994.8 jmol-1
zpe.correction: 0.404492 hartree
zpe.thermalcorrener: 0.431910 hartree
zpe.thermalcorrenthalpy: 0.432854 hartree
zpe.thermalcorrgfe: 0.347124 hartree
zpe.sumelectzpe: -1428.558007 hartree
zpe.sumelectthermal: -1428.530589 hartree
zpe.sumelectthermalent: -1428.529645 hartree
zpe.sumelectthermalfe: -1428.615376 hartree
dipole: 4.1003 0.0009 -0.7048
dipole: 4.1605
quadrupole: -163.3001 -170.0298 -156.2800
quadrupole: 11.0882 19.4550 1.9644
quadrupole: -0.0968 -6.8265 6.9233 11.0882 19.4550 1.9644
hfenergy: -1428.9624993 hartree
pointgroup: C01 [X(C14H25N1O11)]
dipole: 1.556347 0.4612272 0.2106086 debye
polarizability: 218.2463038|9.1833532|218.8239556|-10.7516344|2.493096|156.1024782 unknown
InChI: InChI=1S/C14H25NO11/c1-5(19)15-9-12(24)11(23)8(4-18)25-14(9)26-13(7(21)3-17)10(22)6(20)2-16/h2,6-15,17-18,20-24H,3-4H2,1H3
charge 0 multiplicity 1
51 atoms
O  0.736496 -1.499265 0.119241
O  -0.113126 0.674879 0.180874
O  4.690634 -0.344933 -0.268761
O  3.274607 -2.293153 1.188651
O  -0.291646 -4.126915 -0.767485
O  -1.798304 -1.698727 0.754908
O  -1.339228 2.552609 -1.706573
O  -3.947124 -0.708232 -1.189693
O  -0.724807 3.739625 0.543152
O  1.770959 2.848776 1.122239
O  -5.039066 -2.551463 0.452696
N  2.631223 1.66817 -0.677159
C  2.305262 0.349578 -0.122945
C  3.33523 -0.691575 -0.678441
C  0.865287 -0.1162 -0.457137
C  3.012132 -2.15241 -0.255846
C  1.557507 -2.500952 -0.609773
C  -1.514968 0.532086 -0.344285
C  1.028548 -3.881335 -0.195993
C  -2.322971 -0.335263 0.655279
C  -2.054464 1.957813 -0.580544
C  -3.807292 -0.473013 0.23273
C  -1.934401 2.923155 0.651831
C  2.382247 2.84266 0.0021
C  2.856958 4.124899 -0.662923
C  -4.448686 -1.609858 1.033292
H  2.372201 0.417938 0.980087
H  3.343666 -0.633589 -1.785734
H  0.693274 -0.192571 -1.555147
H  3.730689 -2.832875 -0.743498
H  1.386726 -2.380837 -1.701024
H  -1.491655 0.011575 -1.321389
H  3.226106 1.701357 -1.507678
H  1.034136 -3.977178 0.909234
H  1.681586 -4.66515 -0.615638
H  -2.28591 0.144594 1.658453
H  -3.113667 1.863834 -0.883168
H  4.809245 -0.705561 0.652405
H  2.475673 -1.949618 1.672216
H  -4.340426 0.467335 0.496252
H  -2.772702 3.638708 0.633125
H  -1.957589 2.366096 1.608077
H  -0.970099 -3.51907 -0.365196
H  -0.789405 -1.660459 0.70837
H  -0.755493 3.251768 -1.27963
H  3.548629 4.648192 0.019258
H  1.987798 4.788124 -0.816216
H  3.360198 3.962742 -1.631034
H  -4.369336 -1.550538 2.141762
H  -4.376253 -1.604403 -1.296602
H  0.081205 3.299232 0.95648
