program: Gaussian 09
title: 000014899
version: EM64L-G09RevD.01
frameworkgroup: C1[X(C13H24O2)]
method: RPBEPBE
basis: SDD
operation: Freq
keyword: #pfreq=noraman
keyword: PBEPBE/SDD
title: #p freq=noraman PBEPBE/SDD
converged: YES YES NO NO
title: Mulliken charges:
elementType: O O C C C C C C C C C C C C C H H H H H H H H H H H H H H H H H H H H H H H H
charge: -0.272722 -0.250896 -0.392884 -0.375057 -0.380904 -0.022008 -0.382092 -0.378819 -0.393153 -0.715449 -0.716247 -0.290940 0.253730 -0.211295 -0.476320 0.188748 0.203852 0.192056 0.194166 0.188826 0.188625 0.191704 0.195780 0.195182 0.195248 0.195663 0.213231 0.213222 0.212386 0.211715 0.205796 0.221723 0.210520 0.203313 0.228060 0.228826 0.251657 0.227675 0.247083
chargesum: 0.00000
title: Mulliken charges with hydrogens summed into heavy atoms:
elementType: O O C C C C C C C C C C C C C
charge: -0.272722 -0.250896 -0.000284 0.002393 0.005318 0.169695 0.008870 0.012093 0.033300 -0.085551 -0.080692 0.165946 0.253730 0.040361 -0.001562
polarizability: 2.19288737e+02 2.71503016e+00 1.30575070e+02 6.54177414e-01 -3.46977358e+00 1.06748096e+02
1716.lowfreq: -1.7553 -0.0010 0.0004 0.0008 4.7203 14.4638 18.7340 27.4343 33.3713
frequency: 17.1519 24.7766 32.4307 41.6467 64.0049 82.2518 83.0849 102.2381 116.6947 138.9358 144.1372 155.2535 156.9282 207.6522 210.6109 234.8736 242.4190 292.7023 305.7049 359.4619 392.7340 411.7434 468.8154 473.8158 507.8348 521.0286 649.5496 721.8792 733.4060 759.9565 780.2296 804.6129 820.8302 841.9562 886.3073 916.1071 930.3375 939.8023 951.7864 974.6539 993.0624 1003.7301 1005.3344 1016.8297 1035.8353 1058.5197 1061.0010 1071.8647 1081.8682 1098.6534 1134.7043 1139.8601 1151.8311 1178.1840 1182.7653 1216.6773 1218.8043 1252.6031 1257.8326 1274.5261 1284.0582 1286.0326 1290.2637 1292.2669 1296.5555 1317.1963 1331.1843 1341.8497 1356.3764 1358.8816 1372.8049 1377.8800 1394.6786 1410.2035 1455.1221 1461.5029 1464.3379 1467.6041 1469.1539 1472.4678 1474.3703 1481.8971 1483.6491 1489.0995 1490.1289 1621.8096 1641.6103 2944.6489 2950.7190 2951.8513 2953.4072 2958.5157 2964.3513 2965.1029 2969.6434 2985.3997 2988.3555 2992.6133 2998.5204 3001.7959 3020.7410 3036.8737 3044.5077 3056.5831 3063.6501 3066.9824 3072.2601 3074.0061 3103.7106 3157.0724 3219.7966
redmass: 4.3702 3.4278 4.1012 3.5772 1.9009 3.7510 3.1217 1.7909 2.4685 2.0151 2.1678 3.4743 4.2330 2.6337 1.1292 1.9879 1.3801 3.9045 3.1438 3.1190 2.5132 2.1942 3.0895 2.9445 1.7692 3.7790 3.8189 1.0667 1.0994 1.1560 3.3090 1.6067 1.7150 4.6965 1.2675 1.1752 5.1914 1.9795 1.3886 1.3896 1.4025 4.6683 1.0779 2.9210 1.2725 3.1622 1.6685 2.5752 2.1212 2.8478 4.0908 2.5453 1.4593 1.7418 1.8230 1.3847 1.3347 1.3146 1.2536 1.1436 1.0838 1.3575 1.1870 1.2265 1.1268 1.3792 1.4205 1.4483 1.5828 1.6052 1.5281 1.2210 1.2133 1.2311 1.0741 1.0727 1.0770 1.0797 1.0476 1.0579 1.0888 1.0756 1.0749 1.0775 1.0697 11.4461 4.5642 1.0625 1.0593 1.0725 1.0641 1.0616 1.0519 1.0432 1.0365 1.0959 1.0598 1.0981 1.0566 1.1022 1.1039 1.1041 1.1046 1.0992 1.0990 1.0993 1.1076 1.0985 1.0598 1.0957 1.1157
irintensity: 0.1205 0.9554 0.2106 0.1242 0.7195 0.6321 0.6323 1.1848 0.8484 0.0249 0.0514 0.4105 2.0033 5.3155 0.1097 0.6863 0.2802 9.4534 0.5590 3.7483 1.9363 2.7486 2.1355 1.2066 0.0459 0.4557 2.2370 12.3776 0.5678 4.0618 22.8199 1.0835 1.0381 11.7006 1.4763 3.4478 26.6990 18.5833 0.5242 0.4258 40.7301 0.2741 46.2701 4.3110 3.8740 21.8464 8.6044 5.4933 1.2370 42.4651 457.2569 2.1526 0.8095 10.7565 2.9768 5.4960 6.9646 0.7635 0.0660 0.8320 0.7782 29.0338 4.8054 7.4966 0.7009 3.0328 3.2201 3.5359 1.8008 0.3156 15.2628 18.0350 15.9544 69.9675 0.4170 0.0717 0.1453 0.3872 1.1777 4.5716 2.5051 5.0739 2.4654 5.1736 43.6989 148.9348 20.0664 8.2212 1.3827 7.1697 6.2183 2.6268 64.4121 128.3967 28.7121 2.5418 17.0620 3.5486 40.5614 7.4907 0.9104 76.0020 67.8428 7.9963 91.7705 62.7297 87.0091 57.0876 5.0048 4.4191 8.6557
temp: 298.150 k
press: 1.00000 atm
elementType: 8 8 6 6 6 6 6 6 6 6 6 6 6 6 6 1 1 1 1 1 1 1 1 1 1 1 1 1 1 1 1 1 1 1 1 1 1 1 1
symmnumber: 1
zpe: 901140.5 jmol-1
zpe.correction: 0.343226 hartree
zpe.thermalcorrener: 0.362468 hartree
zpe.thermalcorrenthalpy: 0.363412 hartree
zpe.thermalcorrgfe: 0.292318 hartree
zpe.sumelectzpe: -658.990237 hartree
zpe.sumelectthermal: -658.970995 hartree
zpe.sumelectthermalent: -658.970051 hartree
zpe.sumelectthermalfe: -659.041145 hartree
dipole: -1.0558 1.5072 -0.4355
dipole: 1.8911
quadrupole: -93.0673 -97.6322 -94.4621
quadrupole: 11.6436 -2.0345 0.6921
quadrupole: 1.9866 -2.5784 0.5918 11.6436 -2.0345 0.6921
hfenergy: -659.3334632 hartree
pointgroup: C01 [X(C13H24O2)]
dipole: -0.4143444 0.5952888 -0.1657822 debye
polarizability: 219.3105396|2.3775226|130.590607|-0.0642618|-3.3700066|106.7107557 unknown
InChI: InChI=1S/C13H24O2/c1-4-13(14)15-11-9-7-5-6-8-10-12(2)3/h4,12H,1,5-11H2,2-3H3
charge 0 multiplicity 1
39 atoms
O  3.914189 0.41443 -0.129865
O  5.343011 -1.384781 0.306298
C  -3.674328 0.302646 -0.170703
C  -4.955372 -0.527676 0.071507
C  -2.378752 -0.506559 0.064721
C  -6.283112 0.205672 -0.259568
C  -1.092181 0.316626 -0.167737
C  0.200576 -0.497613 0.063111
C  1.482841 0.339935 -0.152096
C  -7.479343 -0.771203 -0.164184
C  -6.515029 1.434192 0.654049
C  2.745142 -0.493476 0.065509
C  5.176621 -0.171651 0.025492
C  6.237468 0.847712 -0.189603
C  7.552992 0.524667 -0.092836
H  -3.680901 0.688589 -1.212088
H  -3.668141 1.191728 0.491798
H  -2.373784 -1.392476 -0.604672
H  -2.378149 -0.902391 1.102074
H  -4.899945 -1.451499 -0.542403
H  -4.98473 -0.860108 1.131378
H  -6.216306 0.566204 -1.309124
H  -1.093941 0.716424 -1.203207
H  -1.094613 1.198882 0.506051
H  0.207327 -1.372549 -0.620122
H  0.193761 -0.907897 1.094442
H  1.491576 1.199999 0.545075
H  1.493435 0.756845 -1.177628
H  -7.347333 -1.635525 -0.841974
H  -8.429145 -0.270771 -0.430463
H  -7.582151 -1.162731 0.86669
H  -5.715716 2.18896 0.543532
H  -7.476749 1.926877 0.417686
H  -6.54667 1.125773 1.717637
H  2.798193 -0.915827 1.086604
H  2.82716 -1.32936 -0.654377
H  5.897575 1.861224 -0.426566
H  8.339685 1.270033 -0.248912
H  7.854144 -0.501926 0.146872
