program: Gaussian 09
title: 000124576
version: EM64L-G09RevD.01
frameworkgroup: C1[X(C3H8NO3P)]
method: RPBEPBE
basis: SDD
operation: Freq
keyword: #p
keyword: freq=noraman
keyword: PBEPBE/SDD
title: #p freq=noraman PBEPBE/SDD
converged: YES YES NO NO
title: Mulliken charges:
elementType: P O O O N C C C H H H H H H H H
charge: 1.185482 -0.675955 -0.703793 -0.632697 -0.531595 -0.477687 -0.014848 -0.542720 0.309424 0.238719 0.323897 0.293420 0.385191 0.389040 0.225078 0.229044
chargesum: 0.00000
title: Mulliken charges with hydrogens summed into heavy atoms:
elementType: P O O O N C C C
charge: 1.185482 -0.290764 -0.314753 -0.632697 0.085722 -0.168263 0.223871 -0.088598
polarizability: 8.37700580e+01 4.87828872e+00 7.86679168e+01 2.60932646e+00 1.69876479e+00 6.38525495e+01
1716.lowfreq: -13.0422 -9.1134 0.0021 0.0023 0.0027 5.9988 26.7875 60.6375 84.4503
frequency: 26.5373 60.4870 84.4444 127.7705 165.6673 226.6663 250.5622 290.1849 300.9780 322.3907 338.5489 372.7369 388.1359 442.6904 567.0879 609.2843 656.3669 696.7716 734.3285 889.0367 961.7651 962.3497 978.2210 1003.0945 1028.9630 1057.9159 1161.9100 1211.9816 1240.3850 1297.0834 1351.8966 1436.1412 1646.6773 1662.5182 3060.8115 3094.9488 3109.2343 3208.5582 3494.2125 3578.4429 3601.8512 3625.0875
redmass: 3.7423 4.0737 3.5633 3.5379 2.1242 3.6294 4.4098 1.6833 1.3877 1.6596 2.3638 3.5556 1.7850 4.3626 2.8360 1.5130 6.6067 9.2517 2.1088 1.9038 1.6465 1.4749 1.1934 1.1562 1.3190 2.2908 2.2116 1.7339 1.4325 1.2543 1.3332 1.2329 1.1218 4.3258 1.0883 1.0633 1.0907 1.1152 1.0449 1.0662 1.0663 1.1000
irintensity: 5.8465 6.1123 6.7731 12.8705 31.6641 57.2845 34.0541 86.3817 57.9067 6.5572 93.0417 8.6067 52.4341 2.0232 10.6425 433.8293 140.4581 213.9987 87.2524 11.4034 29.8265 43.8596 65.7627 11.7682 24.7084 128.4830 54.9871 9.3935 14.2486 1.6297 2.3389 18.7938 59.9671 7.5880 3.1484 8.3263 5.2856 16.5853 23.6475 44.2395 35.1702 15.7687
temp: 298.150 k
press: 1.00000 atm
elementType: 15 8 8 8 7 6 6 6 1 1 1 1 1 1 1 1
symmnumber: 1
zpe: 306990.0 jmol-1
zpe.correction: 0.116926 hartree
zpe.thermalcorrener: 0.128115 hartree
zpe.thermalcorrenthalpy: 0.129059 hartree
zpe.thermalcorrgfe: 0.079541 hartree
zpe.sumelectzpe: -740.084037 hartree
zpe.sumelectthermal: -740.072849 hartree
zpe.sumelectthermalent: -740.071905 hartree
zpe.sumelectthermalfe: -740.121422 hartree
dipole: -0.5479 0.3335 -0.7237
dipole: 0.9670
quadrupole: -49.6125 -49.5761 -62.7053
quadrupole: 3.2318 -4.7588 3.5357
quadrupole: 4.3521 4.3885 -8.7406 3.2318 -4.7588 3.5357
hfenergy: -740.2009635 hartree
pointgroup: C01 [X(C3H8N1O3P1)]
dipole: 0.2067336 -0.1027912 -0.3023955 debye
dipolederiv: 1.6518355 0.1476019 0.1203913 0.0737797 1.4241318 -0.0620248 0.2604304 -0.2186866 1.3881241 -0.7281069 0.1178492 -0.0571631 0.1875668 -1.1707489 0.2326353 -0.067259 0.3675549 -0.4955288 -1.0531874 -0.217096 -0.2543386 -0.3096404 -0.6480099 -0.034885 -0.3245864 -0.0486875 -0.7511254 -0.772973 0.1067603 0.1161476 0.0823431 -0.6194913 -0.0462824 0.0555694 -0.0586015 -0.7729524 -0.6379036 0.1640737 0.1750531 0.431241 -1.080796 -0.2038184 0.1550912 -0.208631 -0.2694012 0.5663925 -0.2758262 -0.1681011 -0.5293026 1.0345806 0.2161131 -0.1165063 0.1474492 0.024056 -0.0432216 0.0662794 0.0441624 0.1593133 -0.1362432 -0.0909563 0.2452831 -0.1337801 0.0888625 -0.1879781 0.1363676 0.1423826 0.070649 -0.1879191 -0.0882846 0.0653038 -0.0863896 0.0495327 -0.0098498 0.0535415 0.0591578 0.0288503 -0.0072322 0.0241248 0.0232458 0.0158797 -0.0600645 0.069294 -0.0584207 -0.0021409 -0.0182837 0.0770382 0.0972362 -0.056206 0.0793926 -0.0430611 0.1943256 -0.1351371 -0.1231034 -0.0858289 0.2541609 0.0642663 -0.1083683 0.1511091 0.2696034 0.3426803 -0.1069366 -0.0191106 -0.0487936 0.2441243 -0.0032542 -0.0470275 0.0516985 0.0717319 0.3335765 0.020526 0.058207 0.0393771 0.2578228 -0.096183 0.0344505 -0.0612411 0.1738642 0.1454451 0.086044 0.0674293 0.0513892 0.3207205 -0.0705072 0.0337612 -0.0718216 0.3358488 0.0196046 -0.0864693 -0.093347 -0.1198233 0.1274288 -0.0027207 -0.1213208 -0.0084452 0.0401849 0.1100664 -0.0191576 -0.0656265 -0.0128371 0.1104327 0.064541 -0.0318612 0.0832002 -0.049675 unknown
polarizability: 84.5639648|4.7604456|78.0245791|-1.8504902|0.7688619|63.7019804 unknown
InChI: InChI=1S/C3H8NO3P/c1-2-3(4)8(5,6)7/h2-3,5-6H,1,4H2
charge 0 multiplicity 1
16 atoms
P  -1.002397 0.31437 0.105825
O  -0.992837 1.835098 -0.770573
O  -2.122822 -0.651548 -0.823787
O  -1.386987 0.492696 1.648462
N  0.482243 -2.047896 -0.451762
C  0.627737 -0.621369 -0.513517
C  1.784644 -0.104547 0.303683
C  2.664442 0.829674 -0.130281
H  0.68203 -0.270754 -1.55714
H  1.876623 -0.520316 1.317778
H  -0.280546 -2.443796 -1.005874
H  0.604034 -2.479397 0.466785
H  -1.182682 2.614004 -0.18643
H  -3.081694 -0.454494 -0.676731
H  3.480547 1.18055 0.510277
H  2.593664 1.269926 -1.131914
