program: Gaussian 09
title: 000124554
version: EM64L-G09RevD.01
frameworkgroup: C1[X(C7H8N2O3)]
method: RPBEPBE
basis: SDD
operation: Freq
keyword: #pfreq=noraman
keyword: PBEPBE/SDD
title: #p freq=noraman PBEPBE/SDD
converged: YES YES NO NO
title: Mulliken charges:
elementType: O O O N N C C C C C C C H H H H H H H H
charge: -0.495654 -0.198268 -0.218885 0.001932 -0.686386 0.223850 0.230813 0.368341 -0.494046 -0.398266 -0.411823 -0.181713 0.220759 0.264257 0.277397 0.225901 0.234056 0.299416 0.371374 0.366945
chargesum: 0.00000
title: Mulliken charges with hydrogens summed into heavy atoms:
elementType: O O O N N C C C C C C C
charge: -0.128709 -0.198268 -0.218885 0.001932 -0.015595 0.223850 0.230813 0.368341 -0.009030 -0.120869 -0.185922 0.052343
polarizability: 1.38418609e+02 1.19387164e+00 1.30540343e+02 -2.64281907e-01 -1.03449202e+00 4.98167053e+01
1716.lowfreq: -6.0195 -0.0010 -0.0007 -0.0006 5.7074 9.3464 55.0217 68.3662 92.1179
frequency: 54.9964 68.3325 92.1140 113.8097 181.6417 234.2513 255.1354 311.2869 334.0322 367.4240 409.3291 452.9784 462.7371 515.4857 540.1328 591.4735 624.6736 680.9289 702.4957 723.5618 737.9892 795.9401 810.5083 885.6837 896.9035 923.8209 970.3325 989.3116 1051.2114 1106.5588 1152.6608 1170.3417 1195.2689 1209.6723 1245.7832 1254.0462 1333.5935 1359.0133 1398.1677 1408.1919 1459.4611 1463.3413 1492.2781 1576.9271 1616.4342 1642.3765 2955.4795 3110.9202 3129.9957 3157.8241 3195.3924 3425.2823 3605.0240 3644.9991
redmass: 8.0259 1.4960 2.3648 5.7770 4.7029 4.9314 5.0810 3.2882 4.7980 8.2332 3.7309 2.0203 1.7827 3.9343 5.1568 5.2281 4.6913 1.6546 3.2073 2.8681 2.8937 2.3072 3.5218 1.4473 3.6754 7.3906 1.3318 2.0564 2.2094 1.6544 1.4597 1.2216 1.6480 7.3744 1.8452 1.2015 2.0665 5.4682 1.5585 5.4238 2.6929 1.1332 3.8130 5.7771 4.4469 1.2906 1.0684 1.0940 1.0883 1.0944 1.0952 1.0553 1.0674 1.0944
irintensity: 2.9263 69.8242 46.6947 17.0281 2.2749 9.4105 7.7354 5.2155 1.3998 5.5875 8.6335 62.8665 54.6546 1.7930 5.1518 5.6336 15.8735 112.0259 104.0873 34.4378 24.0764 53.4184 22.3634 2.3499 7.7574 77.4142 1.5329 19.3335 1.4878 17.8166 22.0059 1.8739 28.4036 265.3632 20.8723 22.9814 58.2155 101.5440 24.6254 15.5744 15.8727 19.7888 82.1740 0.3396 42.7783 203.0830 49.9506 4.5026 11.7625 18.6889 3.0564 160.8602 14.1021 47.5147
temp: 298.150 k
press: 1.00000 atm
elementType: 8 8 8 7 7 6 6 6 6 6 6 6 1 1 1 1 1 1 1 1
symmnumber: 1
zpe: 389310.0 jmol-1
zpe.correction: 0.148280 hartree
zpe.thermalcorrener: 0.159478 hartree
zpe.thermalcorrenthalpy: 0.160422 hartree
zpe.thermalcorrgfe: 0.110814 hartree
zpe.sumelectzpe: -605.743226 hartree
zpe.sumelectthermal: -605.732029 hartree
zpe.sumelectthermalent: -605.731084 hartree
zpe.sumelectthermalfe: -605.780692 hartree
dipole: 5.2693 0.5505 0.6271
dipole: 5.3349
quadrupole: -72.2206 -55.7199 -72.9922
quadrupole: -2.8292 1.1716 -3.4871
quadrupole: -5.2430 11.2576 -6.0146 -2.8292 1.1716 -3.4871
hfenergy: -605.8915063 hartree
pointgroup: C01 [X(C7H8N2O3)]
dipole: 2.0046479 -0.6019976 0.1564596 debye
dipolederiv: -0.3517236 0.1604985 -0.0263917 0.1346627 -0.7183784 -0.144236 -0.0938755 -0.2974048 -0.6164995 -0.7951244 0.1932632 0.1280867 0.2261036 -0.5348771 -0.174498 0.1235162 -0.1497521 -0.2947537 -0.6446303 -0.1884616 -0.0509801 -0.2123025 -0.7486806 -0.1703676 -0.0252698 -0.1457236 -0.2941193 1.6746256 0.0913779 -0.1222082 0.1320239 1.0220332 0.4079583 -0.1638132 0.3298813 0.3309401 -0.7929054 0.5500762 -0.0418386 0.7148031 -0.8396817 0.0767942 -0.2230981 0.1469545 -0.6481186 -0.1513547 0.446107 -0.0273965 -0.2327121 -0.1838197 -0.0252074 -0.0492087 -0.0339801 -0.0963403 -0.5090319 -0.2747694 0.0632863 -0.1729353 0.3446307 -0.0966737 0.0630542 -0.0357402 0.0426075 0.6223612 -0.8491932 0.0709751 -0.9865742 0.5735227 -0.0271446 0.0606409 0.0360399 0.1137628 0.1782507 -0.0215046 -0.0205558 0.0334272 0.650362 0.1517497 0.0533312 0.2682662 0.4967524 -0.1209372 -0.1094041 0.0019391 0.1693171 -0.3309455 0.011195 0.0609841 0.0384937 -0.1703939 0.0805787 -0.0605423 -0.0151038 0.433991 -0.1819962 -0.0100861 -0.0168005 -0.0308451 -0.1922474 0.1285525 0.1805332 -0.0198007 -0.0171236 0.1613078 -0.026341 -0.0132017 -0.0345739 -0.1130858 0.061021 0.0875107 -0.1064942 -0.0016479 -0.0647735 0.0312126 -0.0267657 -0.0088098 -0.1494227 -0.0166647 -0.0794196 0.0676493 -0.0076381 0.1075393 -0.0472447 0.022523 -0.0917066 0.0598134 0.0562629 0.0569342 -0.0048595 0.0273054 0.0656819 0.0208838 -0.0235725 -0.0059851 0.1817744 -0.1198382 -0.0405486 0.0224346 0.0015668 0.0777208 0.0123528 0.0269509 0.0057215 0.1603489 0.0670864 -0.0537705 0.0087088 -0.0660255 -0.0853135 0.0277724 -0.004055 0.0324729 0.1502654 0.1838592 -0.0621309 0.0171021 -0.0766056 0.144449 -0.0022566 0.0703681 -0.0039814 0.3540706 0.2387084 0.1221238 -0.0057166 0.006912 0.37844 -0.0192417 0.095063 -0.0507319 0.3407047 0.2109039 -0.1486802 0.0611638 -0.1065479 0.1627786 0.0033785 0.0632289 0.0314045 0.3439411 unknown
polarizability: 137.8937824|-1.9421417|130.8691432|-4.2957001|0.2967814|50.0127316 unknown
InChI: InChI=1S/C7H8N2O3/c8-6-2-1-3-7(9(11)12)5(6)4-10/h1-3,10H,4,8H2
charge 0 multiplicity 1
20 atoms
O  0.613678 -2.845901 -0.504816
O  -2.818493 1.291841 0.534424
O  -2.552534 -0.801087 -0.309755
N  -2.073689 0.328966 0.103348
N  2.671533 -1.181139 0.08799
C  0.329586 -0.504478 0.144666
C  -0.601992 0.561725 0.051106
C  1.723181 -0.167499 0.022688
C  -0.009833 -1.938073 0.502795
C  -0.219049 1.915706 -0.100421
C  2.115996 1.194724 -0.134409
C  1.153855 2.219035 -0.185189
H  0.441388 -2.167089 1.491995
H  -1.096373 -2.094223 0.536022
H  -0.987773 2.689033 -0.151827
H  3.182187 1.436177 -0.219192
H  1.472582 3.259167 -0.308348
H  3.65944 -0.949721 0.018277
H  2.360499 -2.134927 -0.129342
H  0.103511 -3.690635 -0.546412
