program: Gaussian 09
title: 000124593
version: EM64L-G09RevD.01
frameworkgroup: C1[X(C23H20O5)]
method: RPBEPBE
basis: SDD
operation: Freq
keyword: #pfreq=noraman
keyword: PBEPBE/SDD
title: #p freq=noraman PBEPBE/SDD
converged: YES YES NO NO
title: Mulliken charges:
elementType: O O O O O C C C C C C C C C C C C C C C C C C C C C C C H H H H H H H H H H H H H H H H H H H H
charge: -0.288446 -0.219452 -0.272487 -0.259687 -0.246186 0.173315 0.135194 0.278702 -0.690816 -0.691462 -0.494687 0.266777 -0.286770 0.174672 -0.798355 0.238783 -0.369346 0.182398 0.063635 0.386718 0.169873 -0.532970 -0.366649 -0.363116 -0.352575 -0.349930 -0.250788 -0.209814 0.234169 0.241239 0.229646 0.229788 0.241663 0.232292 0.274678 0.284324 0.222567 0.244030 0.243297 0.229661 0.226280 0.288233 0.279421 0.254964 0.280282 0.263679 0.236647 0.236611
chargesum: 0.00000
title: Mulliken charges with hydrogens summed into heavy atoms:
elementType: O O O O O C C C C C C C C C C C C C C C C C C C C C C C
charge: -0.288446 -0.219452 -0.272487 -0.259687 -0.246186 0.173315 0.135194 0.278702 0.014237 0.012281 -0.220009 0.266777 -0.002446 0.174672 -0.088461 0.238783 0.086595 0.182398 0.063635 0.386718 0.169873 -0.244737 -0.087228 -0.108151 -0.072293 -0.086251 -0.014141 0.026797
polarizability: 5.03477209e+02 1.64540547e+01 2.65867521e+02 1.15353642e+01 -8.22205461e+00 1.41095958e+02
1716.lowfreq: -4.6405 -0.0008 -0.0002 0.0013 2.5865 4.8769 11.4659 17.1595 24.4500
frequency: 11.3440 16.9705 24.4118 42.0011 58.0652 77.0757 85.0439 100.8634 104.0424 120.2482 134.4486 139.7335 167.9439 180.1103 194.7124 207.0453 219.6864 226.7728 243.8858 262.6945 279.8073 282.9443 284.8594 300.6047 302.6863 358.5133 369.9817 393.9432 415.8891 428.6320 433.7439 459.7748 468.6717 485.9795 522.3103 524.0434 554.9941 574.5069 597.8876 606.9456 613.6102 640.3448 657.2614 664.3709 665.1460 684.4462 704.5745 707.4180 717.5262 748.7933 769.3224 792.2336 803.8143 821.5698 827.9399 831.0316 860.5983 870.5941 884.2244 888.3783 901.6757 927.5879 939.9109 944.1068 960.8759 973.4239 979.2187 983.2052 1001.2850 1001.9864 1002.6348 1025.7367 1045.3033 1057.5473 1090.0659 1099.3812 1105.6793 1132.8982 1147.9606 1162.6022 1167.0565 1179.1566 1196.5386 1199.1079 1205.2303 1217.9647 1226.8532 1249.9332 1254.9297 1270.5408 1303.5731 1315.2176 1344.7808 1373.5080 1380.9454 1389.5311 1394.2506 1397.7480 1406.2377 1440.2657 1448.3975 1453.4751 1460.1346 1460.6576 1462.5284 1469.5731 1470.7841 1476.1162 1482.8591 1486.7960 1550.3493 1560.0117 1561.8896 1596.3074 1613.8736 1617.1867 1639.2576 1667.5092 2937.9390 2986.8043 2994.1542 2996.0785 3020.6233 3063.8244 3098.3954 3099.7110 3102.4718 3103.9385 3104.1243 3139.6347 3143.9642 3152.0640 3152.1259 3166.0513 3175.7742 3176.7209 3185.8782 3229.2527
redmass: 4.3967 6.6694 6.0205 5.2137 4.3325 3.9887 5.9805 4.6212 4.7260 1.0562 4.5165 5.7838 5.2654 3.6037 1.2460 2.1875 5.4143 1.2915 4.1750 3.4072 4.2654 2.9383 2.7481 6.4964 5.3764 5.6247 4.7728 3.3949 5.8074 3.5330 4.4242 3.0504 3.3337 7.2723 7.0466 3.6816 3.8842 7.9032 5.5351 5.7299 6.1515 3.9692 4.8106 3.3296 6.3678 6.1068 2.5083 4.2784 3.6620 7.0862 1.6008 1.8186 3.5608 1.6807 6.3731 1.8863 2.1625 1.5841 1.4974 3.1868 3.7614 6.3787 1.4325 2.1232 2.6104 1.3588 1.3531 3.2208 1.3376 1.6356 1.3721 2.0039 1.4857 2.1272 2.8823 1.8769 1.9793 2.5685 1.7770 1.2026 2.3810 1.8128 1.2698 4.5850 2.6775 1.9857 1.8286 2.7611 4.0565 1.4913 2.0255 2.3179 1.7701 1.2041 2.2885 1.3263 3.0912 9.3725 1.3283 3.6875 2.7612 1.0487 1.2195 1.0528 2.5632 1.0710 1.0659 1.0758 1.0543 2.7872 10.3926 7.6269 8.0277 8.6285 6.9586 10.4904 7.6548 7.0992 1.0616 1.0386 1.0343 1.0348 1.0978 1.0976 1.1003 1.1016 1.1000 1.0997 1.0981 1.0861 1.0897 1.0889 1.0898 1.0955 1.0950 1.0999 1.0929 1.0975
irintensity: 0.2930 0.4966 0.5827 2.9384 1.7528 2.8660 1.1623 0.7833 4.2481 1.0511 2.3138 1.8205 0.9865 1.2368 0.0293 0.7748 1.2607 2.8711 1.5848 2.4619 1.1443 0.3109 2.0779 5.5334 5.2504 2.3450 2.0050 4.4676 2.5341 2.8304 3.3142 0.5499 3.6636 10.5448 13.9969 6.1788 13.9136 8.9904 2.3202 27.3858 0.4576 3.9903 6.9185 22.5902 1.5910 2.8792 2.8399 1.4347 0.1132 5.2701 103.6997 0.0932 42.2770 55.7684 1.7783 15.0911 1.8945 42.2140 0.7377 5.8511 28.4182 0.0073 2.0190 9.5734 21.5464 2.2498 3.4218 196.1082 1.0580 29.2254 8.8876 12.8924 0.4584 33.2875 49.2455 76.2303 209.8967 11.8360 188.4124 17.3335 129.1304 42.0886 14.0783 10.9936 126.3378 88.0115 23.4243 13.6318 181.0807 43.0604 61.6161 176.5248 33.6403 22.1531 4.3565 78.0950 155.5161 30.8892 15.7655 191.5140 91.7848 9.8548 17.1846 0.7720 7.7311 13.2324 13.5922 19.7460 9.5586 21.7465 83.7688 189.3759 202.5890 193.7149 487.3323 220.3297 184.0164 5.6244 28.1719 16.1924 14.4015 13.9897 25.8629 12.7216 3.3352 10.5674 22.5535 18.9307 31.1440 3.8769 0.9835 2.5887 2.3643 14.3090 22.3261 16.1884 0.7485 1.0571
temp: 298.150 k
press: 1.00000 atm
elementType: 8 8 8 8 8 6 6 6 6 6 6 6 6 6 6 6 6 6 6 6 6 6 6 6 6 6 6 6 1 1 1 1 1 1 1 1 1 1 1 1 1 1 1 1 1 1 1 1
symmnumber: 1
zpe: 970893.4 jmol-1
zpe.correction: 0.369794 hartree
zpe.thermalcorrener: 0.395174 hartree
zpe.thermalcorrenthalpy: 0.396118 hartree
zpe.thermalcorrgfe: 0.311953 hartree
zpe.sumelectzpe: -1262.574512 hartree
zpe.sumelectthermal: -1262.549132 hartree
zpe.sumelectthermalent: -1262.548188 hartree
zpe.sumelectthermalfe: -1262.632352 hartree
dipole: 1.0449 0.7661 0.3241
dipole: 1.3356
quadrupole: -201.9799 -149.5036 -164.5303
quadrupole: 24.4706 -11.7685 2.0557
quadrupole: -29.9753 22.5010 7.4743 24.4706 -11.7685 2.0557
hfenergy: -1262.9443059 hartree
pointgroup: C01 [X(C23H20O5)]
dipole: -0.4156678 -0.2974996 0.1217101 debye
polarizability: 503.9738627|13.3749276|265.2342568|-9.5098228|10.0388978|141.2325682 unknown
InChI: InChI=1S/C23H20O5/c1-14(19-13-21(24)23(2,3)28-19)10-11-26-15-8-9-17-20(12-15)27-18-7-5-4-6-16(18)22(17)25/h4-10,12-13H,11H2,1-3H3
charge 0 multiplicity 1
48 atoms
O  5.232148 -0.851152 0.441863
O  8.72762 -0.500039 -0.505906
O  -3.883693 -1.387171 -0.269782
O  0.571921 0.223195 0.045106
O  -5.551401 2.393648 0.556376
C  6.624221 -1.461232 0.418198
C  7.487364 -0.37378 -0.288428
C  5.30987 0.40493 -0.171185
C  6.557401 -2.753845 -0.4067
C  7.066391 -1.676953 1.872091
C  6.586174 0.727092 -0.606909
C  4.066344 1.187188 -0.263002
C  2.913726 0.644524 0.238145
C  -3.585579 1.01691 0.244686
C  4.185462 2.556377 -0.907257
C  -3.055264 -0.275987 -0.037165
C  1.562914 1.297064 0.284383
C  -5.880042 0.046492 0.053514
C  -5.045777 1.250635 0.306496
C  -0.784197 0.554638 0.124673
C  -5.280377 -1.212218 -0.222346
C  -1.673401 -0.518322 -0.09884
C  -2.663449 2.072398 0.462891
C  -1.278274 1.863566 0.407238
C  -7.298405 0.12329 0.079937
C  -6.054735 -2.3669 -0.466749
C  -8.084207 -1.015334 -0.161055
C  -7.4577 -2.262393 -0.434975
H  6.140506 -2.561586 -1.410033
H  7.580625 -3.151617 -0.526105
H  5.931522 -3.508311 0.099803
H  6.433442 -2.435097 2.364144
H  8.115321 -2.021931 1.876059
H  7.008232 -0.736761 2.446698
H  6.886235 1.646491 -1.105209
H  2.957138 -0.356069 0.685273
H  3.20586 3.042787 -1.036858
H  4.814145 3.229442 -0.294633
H  4.659681 2.482804 -1.902865
H  1.378537 1.736951 1.289394
H  1.440027 2.094027 -0.473939
H  -1.29037 -1.517826 -0.315767
H  -3.079178 3.062498 0.677266
H  -0.597643 2.701536 0.577814
H  -7.743878 1.100414 0.294198
H  -5.549683 -3.3144 -0.675016
H  -9.176429 -0.946544 -0.138954
H  -8.068444 -3.151826 -0.623465
