program: Gaussian 09
title: 000124596
version: EM64L-G09RevD.01
frameworkgroup: C1[X(C21H21NO3)]
method: RPBEPBE
basis: SDD
operation: Freq
keyword: #p
keyword: freq=noraman
keyword: PBEPBE/SDD
title: #p freq=noraman PBEPBE/SDD
converged: YES YES NO NO
title: Mulliken charges:
elementType: O O O N C C C C C C C C C C C C C C C C C C C C C H H H H H H H H H H H H H H H H H H H H H
charge: -0.324051 -0.277047 -0.284344 0.003109 -0.184720 0.023177 -0.466149 -0.469835 -0.490616 -0.442483 -0.452318 0.158898 0.015742 0.242465 0.240358 -0.504459 0.143918 0.114909 -0.366694 -0.235878 -0.378058 -0.365201 -0.230727 -0.266340 -0.230106 0.234140 0.248976 0.213580 0.219086 0.237178 0.213136 0.237039 0.256696 0.230533 0.227496 0.229057 0.229282 0.265416 0.249705 0.303027 0.222311 0.257778 0.259103 0.232293 0.228598 0.232019
chargesum: 0.00000
title: Mulliken charges with hydrogens summed into heavy atoms:
elementType: O O O N C C C C C C C C C C C C C C C C C C C C C
charge: -0.324051 -0.277047 -0.284344 0.003109 0.049420 0.272154 -0.033484 -0.019521 0.003118 0.015546 0.006021 0.158898 0.015742 0.242465 0.240358 0.010661 0.143918 0.114909 -0.063666 -0.013566 -0.120280 -0.106099 0.001566 -0.037742 0.001913
polarizability: 3.33639403e+02 -2.19795674e+01 3.46843058e+02 -2.56409284e+00 -1.03274649e+00 1.30901954e+02
1716.lowfreq: -6.2569 -0.0006 0.0003 0.0005 3.3657 7.4528 13.8860 30.1503 41.0914
frequency: 13.2694 29.9256 41.0655 59.3745 61.2208 88.9827 104.0862 118.1068 168.9105 176.5388 194.2222 238.2174 255.6895 263.8094 287.2501 306.6318 336.0652 352.2042 389.0719 396.5078 404.2125 423.1173 428.3620 464.2142 470.1135 491.8561 535.2704 544.5988 564.7458 574.3565 586.2071 602.2427 609.2018 638.7071 652.6054 706.8023 708.4761 711.2257 745.2209 754.2336 771.7448 777.8885 789.3495 806.4240 821.0351 830.9296 842.4652 862.2998 871.3419 871.8631 890.6738 904.0783 910.9108 934.3403 946.0248 955.1405 958.9515 967.5639 984.6411 988.2674 990.8744 1000.1063 1022.0069 1041.5248 1044.7813 1055.1471 1073.1407 1092.4979 1098.3623 1124.8531 1129.5563 1155.2010 1162.9143 1167.2883 1175.7651 1192.9578 1199.7327 1201.6983 1215.0789 1230.8563 1231.3607 1268.1426 1277.3837 1292.5317 1295.9625 1298.1495 1303.5400 1308.5306 1313.6766 1314.7782 1322.7189 1327.1071 1347.9869 1360.5560 1372.1883 1381.4552 1397.5561 1411.8922 1433.1413 1445.0919 1459.6726 1468.6178 1469.2991 1476.5229 1481.6043 1489.7999 1536.0359 1573.8921 1585.3362 1616.7073 1641.9184 2958.2429 2985.4753 2990.7694 2992.0178 3003.2512 3005.1884 3012.4941 3028.7318 3040.8355 3045.4269 3048.8009 3068.1441 3074.9093 3083.5978 3129.7590 3137.0024 3153.7775 3155.3225 3171.6642 3173.1404 3200.4127
redmass: 4.4665 4.5656 4.5884 4.3693 5.1537 3.3464 3.7194 4.3509 5.2965 2.6053 2.6250 5.6076 4.9232 3.2420 3.0340 3.2650 3.6085 6.4563 6.7664 2.3685 2.4095 4.0677 4.0900 4.2221 3.6131 3.3056 4.1770 4.2777 5.0416 5.4133 7.3253 4.7747 7.4889 6.2264 2.9233 6.1829 1.3988 5.8076 4.4187 2.7109 1.5720 4.3207 1.4735 1.7309 3.7239 2.9059 3.3823 1.5233 2.8572 1.4634 4.8854 3.7350 2.2970 2.1275 5.2029 1.3773 3.4266 1.2961 2.5429 1.3241 2.5996 2.8467 2.8128 2.2250 2.3450 2.7679 2.4639 3.1978 1.6456 1.8665 1.3892 2.4555 1.1914 1.2680 1.2488 1.0967 1.3580 1.9830 1.3533 3.3998 1.2836 1.4580 1.5836 1.6640 1.3087 1.7259 1.2919 1.4257 1.4273 1.3666 1.7121 1.3012 1.3721 1.5068 1.8651 7.2294 1.3234 2.4035 2.5582 1.0807 1.0783 1.0848 1.0834 2.8154 1.0956 6.9617 7.9918 6.5954 9.2832 7.1074 6.3006 1.0669 1.0595 1.0857 1.0624 1.0613 1.0627 1.0617 1.0863 1.1030 1.0912 1.0990 1.1054 1.1050 1.1044 1.0850 1.0863 1.0949 1.0924 1.0969 1.0982 1.0937
irintensity: 0.9561 0.0949 0.8468 2.8260 0.4610 0.2894 0.5538 0.1230 0.6369 0.2829 1.2446 0.3827 4.3627 2.2685 6.4110 1.0371 5.9751 0.6141 2.3689 1.0362 0.9884 1.4008 1.0679 3.5801 7.4515 1.4835 1.4815 0.5526 3.7824 5.4752 11.4352 1.7604 7.2189 13.8665 22.9862 6.8019 54.7641 2.0493 16.3503 10.1988 93.5765 29.7460 3.3280 9.8927 6.2362 11.8001 5.2119 15.7520 1.4993 0.8181 21.8532 6.9248 5.9216 22.4978 55.6386 7.0131 137.1250 0.2115 7.4624 0.7528 39.3552 40.8802 4.7670 10.2805 8.7950 56.8496 39.1650 62.4487 0.5218 59.4013 2.6033 146.3004 9.5867 9.2411 18.0569 1.4183 6.9556 10.9196 5.8248 58.8361 2.3222 1.0950 70.1353 32.9950 1.4416 15.4664 1.4439 1.8304 2.6503 1.8759 23.3209 0.1305 0.7701 8.8846 63.5187 35.7412 65.8922 27.6876 36.8544 15.5535 2.1630 12.0954 14.7910 17.0282 8.4783 31.7457 61.1764 70.5416 239.7067 9.2191 5.8015 2.4200 32.6189 12.0559 17.8338 88.1108 74.8194 22.3178 3.8063 7.2945 27.7900 6.7211 16.7114 102.5526 34.0071 3.9838 5.0455 46.9321 17.4538 9.9876 15.0712 15.0137
temp: 298.150 k
press: 1.00000 atm
elementType: 8 8 8 7 6 6 6 6 6 6 6 6 6 6 6 6 6 6 6 6 6 6 6 6 6 1 1 1 1 1 1 1 1 1 1 1 1 1 1 1 1 1 1 1 1 1
symmnumber: 1
zpe: 978062.7 jmol-1
zpe.correction: 0.372524 hartree
zpe.thermalcorrener: 0.392794 hartree
zpe.thermalcorrenthalpy: 0.393738 hartree
zpe.thermalcorrgfe: 0.322006 hartree
zpe.sumelectzpe: -1091.422439 hartree
zpe.sumelectthermal: -1091.402169 hartree
zpe.sumelectthermalent: -1091.401225 hartree
zpe.sumelectthermalfe: -1091.472957 hartree
dipole: -1.8828 2.0331 1.8194
dipole: 3.3149
quadrupole: -133.0526 -137.2726 -153.3203
quadrupole: -3.6822 -7.7770 -3.4479
quadrupole: 8.1626 3.9425 -12.1052 -3.6822 -7.7770 -3.4479
hfenergy: -1091.794963 hartree
pointgroup: C01 [X(C21H21N1O3)]
dipole: 0.6817663 0.6086305 -0.9304214 debye
polarizability: 330.1804619|19.6217702|331.5419115|-6.2676798|-61.4233916|149.6620409 unknown
InChI: InChI=1S/C21H21NO3/c23-21(25-19-13-22-11-9-14(19)10-12-22)20-15-5-1-3-7-17(15)24-18-8-4-2-6-16(18)20/h1-5,7-8,14,19H,6,9-13H2
charge 0 multiplicity 1
46 atoms
O  1.292944 -0.283433 -0.345818
O  0.489292 -2.058976 0.902674
O  -3.781928 0.614069 -0.287836
N  4.524343 0.111211 1.208383
C  3.595019 -0.237632 -1.196544
C  2.65433 -0.887524 -0.161874
C  4.976501 -0.939554 -1.053675
C  3.767168 1.27937 -0.908556
C  3.225217 -0.614355 1.274204
C  5.502928 -0.690002 0.41058
C  4.321212 1.44117 0.554528
C  0.23851 -1.005029 0.252344
C  -1.110422 -0.419699 0.022672
C  -1.311552 0.907438 -0.40931
C  -2.297747 -1.279711 0.290756
C  -0.194489 1.889612 -0.765781
C  -2.662161 1.42966 -0.542193
C  -3.597378 -0.725755 0.107024
C  -2.256436 -2.648436 0.690603
C  -0.592336 3.305432 -1.097169
C  -2.957332 2.735865 -0.902285
C  -4.784585 -1.453462 0.30016
C  -1.904179 3.692175 -1.169458
C  -3.436139 -3.396013 0.886205
C  -4.705908 -2.804586 0.694091
H  3.189184 -0.393121 -2.211761
H  2.552225 -1.972611 -0.343725
H  5.672812 -0.523114 -1.805264
H  4.879947 -2.022135 -1.262563
H  2.800392 1.798408 -1.029474
H  4.466682 1.710619 -1.64908
H  2.509002 0.001308 1.84757
H  3.365554 -1.561178 1.821993
H  5.672275 -1.644503 0.94089
H  6.461756 -0.141485 0.40118
H  5.290276 1.971797 0.561021
H  3.622033 2.020815 1.184342
H  0.374052 1.464395 -1.619879
H  0.564356 1.892271 0.042098
H  -1.285369 -3.111394 0.865711
H  0.221468 4.011963 -1.298511
H  -4.009513 3.028628 -0.965208
H  -5.741605 -0.94918 0.13834
H  -2.176565 4.721145 -1.426827
H  -3.35989 -4.443527 1.19606
H  -5.622244 -3.383635 0.849562
