program: Gaussian 09
title: 000124478
version: EM64L-G09RevD.01
frameworkgroup: C1[X(C16H14N2O3)]
method: RPBEPBE
basis: SDD
operation: Freq
keyword: #p
keyword: freq=noraman
keyword: PBEPBE/SDD
title: #p freq=noraman PBEPBE/SDD
converged: YES YES NO NO
title: Mulliken charges:
elementType: O O O N N C C C C C C C C C C C C C C C C H H H H H H H H H H H H H H
charge: -0.216499 -0.413715 -0.227865 -0.326284 -0.479305 -0.244090 0.154850 0.146437 -0.537050 -0.189536 0.159791 0.196730 0.271419 0.137941 -0.416945 -0.369719 -0.415203 -0.254083 -0.220537 -0.264301 -0.176325 0.250906 0.237104 0.232178 0.272964 0.293624 0.314873 0.232826 0.231673 0.277908 0.220242 0.221250 0.255369 0.262278 0.381095
chargesum: 0.00000
title: Mulliken charges with hydrogens summed into heavy atoms:
elementType: O O O N N C C C C C C C C C C C C C C C C
charge: -0.216499 -0.032621 -0.227865 -0.032660 -0.164432 0.006816 0.154850 0.146437 -0.067768 0.083428 0.159791 0.196730 0.271419 0.137941 -0.184119 -0.138046 -0.137295 -0.033841 0.000713 -0.008932 0.085953
polarizability: 2.48875615e+02 -1.05816229e+01 2.09035836e+02 -9.55465269e+00 2.79469223e+00 1.17854225e+02
1716.lowfreq: -7.9668 -0.0008 0.0004 0.0004 2.2610 8.0752 32.8537 43.5099 49.6397
frequency: 32.8419 43.4878 49.6171 51.8210 58.7141 104.6740 120.5423 161.9089 180.9603 216.4320 259.0497 277.0788 284.9717 297.9417 322.2741 335.8749 425.4337 437.7886 505.0702 516.4841 522.8238 561.4681 573.6771 577.5011 581.5799 595.9748 609.3823 615.0218 647.8977 665.7330 706.8296 735.5081 743.3226 749.9226 756.3639 760.3643 765.7543 828.4295 836.8863 851.8968 872.6870 873.4284 883.4371 903.9628 930.1177 933.0386 967.7272 970.9637 987.0253 1005.9496 1011.3547 1037.6159 1045.7812 1086.0383 1105.5974 1120.0887 1132.2141 1145.4774 1148.9410 1168.7122 1193.6449 1218.5488 1224.0832 1225.2584 1238.1104 1264.3377 1282.5523 1299.6991 1309.2926 1320.7212 1351.4050 1355.4748 1374.3642 1408.0658 1434.8909 1443.5281 1464.2269 1467.2511 1481.3490 1482.9802 1574.6039 1581.2392 1596.0665 1632.2047 1664.3484 2935.5522 2961.4668 3019.6753 3037.3716 3122.7618 3130.0822 3143.9551 3161.9607 3218.2491 3233.1671 3268.6882 3453.8142 3505.9797 3599.7856
redmass: 8.9924 4.6663 5.0588 4.4868 6.0488 6.1822 5.0852 3.5890 4.2541 4.8120 7.5098 6.1963 5.4472 5.9364 4.1336 3.8075 3.0393 5.2651 3.3618 1.3117 4.1541 2.2536 2.9886 4.1355 2.6976 3.0446 1.5195 4.8244 3.2611 4.0983 4.2796 1.3221 3.5803 1.5456 4.4343 4.2531 4.5677 1.2876 3.2346 1.5057 5.1708 4.0560 1.3996 3.9088 1.7454 2.1889 4.0926 1.3016 3.2696 1.7170 1.9934 2.4299 2.7944 3.5601 2.1540 2.3747 1.5557 2.0951 2.6109 1.1794 1.4209 1.4643 1.5510 1.4196 1.9133 1.2794 1.8321 1.7730 2.3585 1.3418 2.1192 2.0156 2.1521 4.7738 2.9755 1.2550 1.9857 1.7195 3.3874 4.4489 6.7690 6.6522 7.0242 7.1244 8.6905 1.0816 1.0629 1.0917 1.0911 1.0848 1.0891 1.0952 1.1001 1.0928 1.0986 1.1081 1.0755 1.0639 1.0803
irintensity: 1.3721 0.8113 0.1867 0.2350 1.1331 0.9189 0.2263 1.5386 2.5367 1.2432 2.2426 1.5678 0.9167 5.5848 1.0998 3.5168 12.0290 10.9761 30.9358 80.1908 17.8699 18.3872 24.5483 4.8411 37.7407 2.3898 146.8582 18.9954 73.4050 3.4998 28.5339 83.2457 22.6482 99.4625 0.6704 3.8467 6.6977 15.5705 11.5424 0.2829 1.5817 1.1094 0.8750 4.9650 0.5368 5.2652 23.5721 0.0064 3.8267 25.2368 7.9148 209.5029 4.6509 116.1518 9.0206 10.1946 13.1232 5.3207 48.7082 3.0923 8.0104 1.9631 5.0674 21.6481 9.8581 9.6510 15.3042 6.7741 50.6849 29.4532 51.8948 31.9312 13.6980 16.4905 6.2149 33.8617 15.9792 17.5273 4.0835 5.6140 1.1662 1.4144 2.7787 1.6163 211.8897 20.5928 32.4465 3.9277 29.2633 1.3524 3.2841 34.5374 34.8070 5.7641 0.0598 0.3172 9.5410 23.6576 54.9469
temp: 298.150 k
press: 1.00000 atm
elementType: 8 8 8 7 7 6 6 6 6 6 6 6 6 6 6 6 6 6 6 6 6 1 1 1 1 1 1 1 1 1 1 1 1 1 1
symmnumber: 1
zpe: 708070.9 jmol-1
zpe.correction: 0.269690 hartree
zpe.thermalcorrener: 0.286916 hartree
zpe.thermalcorrenthalpy: 0.287860 hartree
zpe.thermalcorrgfe: 0.223044 hartree
zpe.sumelectzpe: -951.782305 hartree
zpe.sumelectthermal: -951.765079 hartree
zpe.sumelectthermalent: -951.764135 hartree
zpe.sumelectthermalfe: -951.828951 hartree
dipole: -0.7816 -1.7405 -0.0384
dipole: 1.9083
quadrupole: -126.0658 -96.4918 -124.8316
quadrupole: -4.0739 -2.0388 -0.7662
quadrupole: -10.2694 19.3046 -9.0352 -4.0739 -2.0388 -0.7662
hfenergy: -952.0519951 hartree
pointgroup: C01 [X(C16H14N2O3)]
dipole: 0.2728756 0.6994582 -0.0002872 debye
polarizability: 249.3516749|-8.6277708|208.1203972|12.4600927|-1.359547|118.2936032 unknown
InChI: InChI=1S/C16H14N2O3/c19-16(20)12-8-10-9-4-1-2-5-11(9)17-14(10)15(18-12)13-6-3-7-21-13/h1-7,12,15,17-19H,8H2
charge 0 multiplicity 1
35 atoms
O  -3.102419 2.033557 -0.847022
O  -1.577864 -4.484036 -0.673598
O  -2.683723 -3.334394 1.01673
N  -1.91279 -0.912837 -0.215344
N  1.067973 1.447603 -0.528101
C  -1.279918 0.350548 -0.697979
C  0.938169 -0.767832 0.01574
C  0.205805 0.349175 -0.381639
C  0.308803 -2.120984 0.234571
C  -1.109537 -2.127897 -0.456325
C  2.321448 -0.349068 0.142522
C  2.372968 1.050749 -0.204286
C  -1.983898 1.552747 -0.128517
C  -1.893655 -3.328451 0.048081
C  3.521866 -1.011477 0.511223
C  3.576128 1.788151 -0.183227
C  -1.808206 2.324811 1.011778
C  4.72579 -0.280081 0.530959
C  4.752628 1.104463 0.188858
C  -2.854115 3.32728 1.019389
C  -3.615136 3.119634 -0.117935
H  -1.414334 0.385493 -1.801523
H  0.928075 -2.931392 -0.195152
H  0.196251 -2.336751 1.317327
H  -0.952344 -2.237377 -1.544922
H  -2.248867 -0.850581 0.755455
H  0.769948 2.392575 -0.762982
H  3.513804 -2.074413 0.778341
H  3.603795 2.851412 -0.447053
H  -1.02654 2.187241 1.756788
H  5.660122 -0.777909 0.813393
H  5.705088 1.645609 0.214123
H  -3.017289 4.097101 1.77087
H  -4.4883 3.603585 -0.546022
H  -2.065929 -5.260955 -0.285522
