program: Gaussian 09
title: 000124472
version: EM64L-G09RevD.01
frameworkgroup: C1[X(C15H17NO5)]
method: RPBEPBE
basis: SDD
operation: Freq
keyword: #p
keyword: freq=noraman
keyword: PBEPBE/SDD
title: #p freq=noraman PBEPBE/SDD
converged: YES YES NO NO
title: Mulliken charges:
elementType: O O O O O N C C C C C C C C C C C C C C C H H H H H H H H H H H H H H H H H
charge: -0.195633 -0.252839 -0.415162 -0.227496 -0.258152 -0.265125 -0.018323 -0.480768 -0.546552 -0.411043 0.151107 -0.496431 0.140965 0.304479 0.176843 -0.355047 -0.269964 -0.360778 -0.373375 0.335687 -0.537072 0.276408 0.239259 0.223755 0.264811 0.251304 0.234694 0.251130 0.269691 0.252707 0.263267 0.251215 0.243700 0.254999 0.378581 0.224844 0.226095 0.248219
chargesum: 0.00000
title: Mulliken charges with hydrogens summed into heavy atoms:
elementType: O O O O O N C C C C C C C C C C C C C C C
charge: -0.195633 -0.252839 -0.036580 -0.227496 -0.258152 -0.265125 0.258085 -0.017753 -0.030438 0.074781 0.151107 0.025966 0.140965 0.304479 0.176843 -0.091780 -0.018749 -0.117078 -0.118376 0.335687 0.162086
polarizability: 2.72481600e+02 -2.24331532e+01 1.46407995e+02 -1.55845197e+01 -1.15632295e+01 1.57923212e+02
1716.lowfreq: -4.5590 -0.0004 -0.0003 0.0007 1.4893 6.6860 18.8018 21.5358 28.7438
frequency: 18.7037 21.2884 28.6704 45.8033 57.1653 77.1967 92.8953 96.3814 112.4038 135.8670 147.8338 169.9367 192.9789 219.2359 227.8179 243.5633 274.3598 300.9971 332.2531 379.2618 416.0447 419.3438 427.8952 482.3983 484.1664 508.2102 524.0720 545.3901 569.2460 587.7086 615.1009 626.7258 643.9691 650.5181 695.1971 724.5186 759.9045 766.9608 778.8936 814.3130 817.0605 839.3389 850.4729 889.9645 931.9595 957.9845 966.0810 970.5961 983.6813 1000.1638 1001.2072 1020.9748 1036.3217 1080.8127 1086.4961 1094.8076 1112.1773 1119.5572 1135.4453 1142.8149 1157.4956 1175.5770 1191.8623 1194.0092 1219.1091 1241.0921 1243.5003 1267.0484 1276.3311 1289.8269 1299.3649 1305.4964 1316.0914 1339.3736 1363.3200 1375.3736 1380.4780 1428.8640 1436.8859 1442.0914 1450.6032 1466.9273 1467.6222 1471.4879 1477.1567 1498.5529 1545.7055 1580.6123 1619.5763 1654.4028 1668.5703 2965.9453 2985.5513 3006.7404 3009.2905 3019.7237 3041.9386 3046.9117 3057.2406 3074.1285 3081.2366 3098.3474 3129.7635 3149.8251 3162.3938 3170.4711 3184.5556 3512.6721
redmass: 10.5194 8.0142 5.0922 4.9203 4.4271 4.2010 5.5949 2.8671 3.1043 2.3999 4.4444 4.4788 3.9551 1.5596 3.1006 3.7226 3.9261 5.2277 6.7372 5.2236 3.0302 3.2514 5.7259 3.4472 3.7789 1.9822 3.0936 2.6985 5.6702 4.2854 5.6974 6.7635 1.3670 4.5022 4.3159 3.7180 2.7574 2.4251 3.3577 1.2477 1.9849 1.9546 3.9797 3.7923 2.6282 1.3828 1.3753 1.7170 8.4583 2.3634 2.8707 3.5767 2.8070 1.9558 2.2753 2.1915 1.2594 1.3456 5.0240 1.2715 1.3300 1.3604 1.9762 1.4335 1.7459 3.0383 1.4457 1.3179 3.7441 1.4428 1.6032 1.2869 1.4203 1.6349 1.3876 5.1111 1.7389 3.9494 1.2088 1.0828 1.0804 1.0904 1.0503 1.0770 1.0946 2.4860 10.0528 7.6441 6.3662 12.0606 8.3079 1.0326 1.0636 1.0625 1.0643 1.0634 1.0903 1.0896 1.1043 1.1025 1.1010 1.0991 1.0999 1.0877 1.0883 1.0959 1.0972 1.0640
irintensity: 1.0671 2.2220 0.1778 2.8267 4.1582 0.2977 2.7315 1.5430 1.2023 0.4171 7.8618 1.2552 6.0326 4.8805 1.5741 5.5083 2.4681 4.1851 2.3466 2.4484 0.2650 4.9114 1.7152 46.5532 6.9406 33.3416 4.1293 3.2076 42.5063 18.2935 16.2604 3.7561 119.3326 14.6441 8.7327 24.8232 31.2617 4.5040 16.9453 3.0851 7.9019 51.4580 22.6197 5.9891 3.5051 3.9524 2.7697 6.5031 57.9948 34.6961 9.0663 17.5067 226.7779 11.9960 75.7894 9.0661 0.3268 16.9295 20.6634 4.6849 1.3925 333.7156 107.4845 13.5611 64.0258 150.0098 6.9471 56.3777 484.9613 93.8443 91.4342 5.8334 3.0123 28.0166 35.3373 37.3032 19.8876 1.6267 12.1510 19.6275 12.2157 19.6008 14.1052 61.0449 8.1045 71.6609 122.9702 68.4771 203.1770 298.0217 217.8231 72.9148 10.6400 2.9950 18.0466 21.9305 13.0939 13.8047 43.0610 14.6444 26.1839 19.0194 23.7232 2.5035 4.2585 14.0781 4.2698 23.3912
temp: 298.150 k
press: 1.00000 atm
elementType: 8 8 8 8 8 7 6 6 6 6 6 6 6 6 6 6 6 6 6 6 6 1 1 1 1 1 1 1 1 1 1 1 1 1 1 1 1 1
symmnumber: 1
zpe: 782323.4 jmol-1
zpe.correction: 0.297971 hartree
zpe.thermalcorrener: 0.318254 hartree
zpe.thermalcorrenthalpy: 0.319198 hartree
zpe.thermalcorrgfe: 0.245741 hartree
zpe.sumelectzpe: -1011.134153 hartree
zpe.sumelectthermal: -1011.113870 hartree
zpe.sumelectthermalent: -1011.112926 hartree
zpe.sumelectthermalfe: -1011.186383 hartree
dipole: -0.8199 -0.0652 0.9752
dipole: 1.2757
quadrupole: -84.9675 -123.5539 -128.7281
quadrupole: -14.4848 6.5274 -0.0511
quadrupole: 27.4490 -11.1374 -16.3116 -14.4848 6.5274 -0.0511
hfenergy: -1011.4321238 hartree
pointgroup: C01[X(C15H17N1O5)]
dipole: -0.3177409 0.0757711 0.381068 debye
polarizability: 272.7846779|-24.3578842|140.6132647|-10.4824516|-6.5788548|163.4148642 unknown
InChI: InChI=1S/C15H17NO5/c1-21-12-6-2-10(3-7-12)15(20)16-11(4-8-13(16)17)5-9-14(18)19/h2-3,6-7,11,18H,4-5,8-9H2,1H3
charge 0 multiplicity 1
38 atoms
O  0.651603 2.550712 -1.377877
O  -0.148342 0.194092 2.09608
O  -5.935639 -2.044008 0.802944
O  -4.477728 -2.323839 -0.98197
O  5.475053 -0.91305 -0.803565
N  -0.704566 1.233298 0.098142
C  -2.157071 1.150132 0.473032
C  -2.780197 2.406273 -0.202142
C  -1.826928 2.734355 -1.371467
C  -2.7538 -0.194206 -0.009778
C  -0.462802 2.1960 -0.926066
C  -4.134301 -0.459926 0.619055
C  0.238781 0.556073 0.941232
C  1.606698 0.249001 0.448199
C  -4.813231 -1.68635 0.039547
C  2.624578 0.075857 1.421313
C  1.918244 0.006436 -0.919051
C  3.931031 -0.296214 1.05456
C  3.20769 -0.390382 -1.296958
C  4.223153 -0.531758 -0.314799
C  6.569661 -1.070982 0.160401
H  -2.2208 1.196795 1.573894
H  -2.803574 3.247528 0.51264
H  -3.814741 2.218597 -0.535217
H  -1.744327 3.807699 -1.603192
H  -2.11411 2.216125 -2.30646
H  -2.833164 -0.20746 -1.11288
H  -2.067841 -1.0136 0.270829
H  -4.058281 -0.589112 1.714729
H  -4.822697 0.395561 0.462943
H  2.370464 0.233472 2.474519
H  1.151156 0.119171 -1.688616
H  4.699108 -0.404077 1.825612
H  3.459549 -0.589133 -2.342421
H  -6.370195 -2.840801 0.392769
H  6.342251 -1.863848 0.898497
H  6.780253 -0.119786 0.685663
H  7.440862 -1.363444 -0.443241
