program: Gaussian 09
title: 000124355
version: EM64L-G09RevD.01
frameworkgroup: C1[X(C6H11NO2)]
method: RPBEPBE
basis: SDD
operation: Freq
keyword: #p
keyword: freq=noraman
keyword: PBEPBE/SDD
title: #p freq=noraman PBEPBE/SDD
converged: YES YES NO NO
title: Mulliken charges:
elementType: O O N C C C C C C H H H H H H H H H H H
charge: -0.420857 -0.230826 -0.582416 -0.135669 -0.095889 -0.499835 -0.468507 -0.439399 0.137221 0.263226 0.233852 0.215298 0.259907 0.236938 0.221568 0.220493 0.192795 0.251914 0.266168 0.374018
chargesum: 0.00000
title: Mulliken charges with hydrogens summed into heavy atoms:
elementType: O O N C C C C C C
charge: -0.046839 -0.230826 -0.064334 0.127557 0.137963 -0.024630 -0.010001 -0.026110 0.137221
polarizability: 9.23376213e+01 8.90738712e-01 6.94573914e+01 -2.44583571e-01 -2.63967018e+00 6.35599022e+01
1716.lowfreq: -8.3909 -2.3378 0.0004 0.0006 0.0007 11.2640 22.5786 38.0633 160.0182
frequency: 21.4394 37.6254 160.0152 193.6514 232.6943 271.7826 325.4153 368.0481 447.9818 523.5588 567.0617 587.4758 596.0829 607.0632 705.4985 784.4478 816.0523 862.9833 915.0290 949.3072 964.3113 996.1549 1032.5179 1057.8796 1080.7487 1104.5669 1132.7269 1151.6604 1186.8991 1236.2946 1251.4639 1268.4955 1272.8241 1299.2776 1301.6726 1306.0651 1359.3734 1378.2100 1460.8383 1466.1238 1476.1208 1636.7009 1661.7273 2975.9424 2995.9463 2999.9082 3010.0990 3037.2905 3055.9480 3081.1851 3088.1557 3451.6390 3507.3296 3583.4785
redmass: 5.4059 3.4369 3.1842 2.4786 1.2142 2.7023 3.3499 2.7325 1.8926 2.7158 1.6694 3.0395 2.1668 1.6529 3.3616 2.4658 2.5108 2.3029 1.9313 1.6367 2.2150 1.6359 2.7840 1.7598 2.0390 2.1033 2.5382 1.4649 1.4971 1.4601 1.4612 1.3215 1.2690 1.3039 1.2438 1.4166 1.9071 1.3717 1.0878 1.0846 1.0981 1.0974 8.1998 1.0648 1.0831 1.0641 1.0658 1.0839 1.1002 1.1020 1.1007 1.0448 1.0638 1.0976
irintensity: 0.5264 0.3169 2.1524 3.2540 45.0207 6.3241 5.7910 31.7018 5.9996 5.7862 261.2900 34.3285 13.1346 93.3212 46.2702 1.7457 4.7987 7.7619 9.4374 24.0662 4.2855 3.4627 215.2033 1.1126 78.7347 27.7527 19.0260 5.2624 13.6691 0.0516 3.9307 0.9446 4.1490 6.7686 2.9062 8.3049 52.7689 9.4566 12.3022 9.4550 7.8818 38.1909 210.7869 29.7367 22.8673 28.3573 24.5718 13.7614 44.5911 19.7204 36.6648 0.6607 18.3300 0.2607
temp: 298.150 k
press: 1.00000 atm
elementType: 8 8 7 6 6 6 6 6 6 1 1 1 1 1 1 1 1 1 1 1
symmnumber: 1
zpe: 441678.0 jmol-1
zpe.correction: 0.168226 hartree
zpe.thermalcorrener: 0.177653 hartree
zpe.thermalcorrenthalpy: 0.178597 hartree
zpe.thermalcorrgfe: 0.132298 hartree
zpe.sumelectzpe: -439.718795 hartree
zpe.sumelectthermal: -439.709368 hartree
zpe.sumelectthermalent: -439.708424 hartree
zpe.sumelectthermalfe: -439.754723 hartree
dipole: -0.9586 2.4509 -0.8887
dipole: 2.7777
quadrupole: -45.8101 -60.7500 -53.8285
quadrupole: -1.9385 -0.6159 2.9677
quadrupole: 7.6527 -7.2871 -0.3656 -1.9385 -0.6159 2.9677
hfenergy: -439.8870208 hartree
pointgroup: C01 [X(C6H11N1O2)]
dipole: -0.380882 -1.005742 0.1941136 debye
dipolederiv: -0.9738273 0.4262893 -0.3313854 0.4001917 -0.565696 0.11209 -0.2685631 0.0855059 -0.4600963 -0.7017713 -0.1699848 0.0848717 0.0281795 -0.7747808 0.2609775 0.0318766 0.3338478 -0.4835179 -0.6531324 0.1791397 0.0898901 0.2779966 -0.7918039 -0.1209626 0.130803 -0.1451372 -0.1979632 -0.3291725 -0.116338 -0.0072473 -0.2668322 -0.0738034 -0.0250747 -0.0410061 -0.0496968 0.0955917 0.6391043 -0.1833057 -0.1051148 -0.1325217 0.4279276 0.0309068 -0.0466423 0.0514641 0.2415075 -0.0299805 -0.0212727 -0.0628432 -0.0814062 -0.0103895 -0.0346964 -0.1256198 -0.0203246 0.0714568 0.0439007 -0.0031285 0.0317902 0.1626154 0.1292989 -0.0524678 0.1438534 0.0550755 0.1276341 -0.1009065 0.0865608 0.0362224 0.1167067 -0.1529624 -0.0529294 -0.05744 -0.0899813 0.1414808 1.5901728 -0.0569363 0.1483972 -0.1517466 0.9965833 -0.5167976 0.0671422 -0.5661377 0.4720488 0.0388015 0.013679 -0.0110631 0.0480983 0.0265376 0.0672159 -0.0168124 0.0627015 -0.0660151 0.0260171 -0.0060843 0.0271906 0.0205258 -0.0093454 0.0590164 0.0177516 0.0650981 -0.1434579 -0.0019717 0.0357894 0.0785146 0.0255792 0.0694599 -0.0000669 0.06537 -0.0457026 -0.1299211 0.0838665 -0.069722 -0.0050856 -0.0326934 -0.0701225 0.0074683 0.0007719 0.0477162 0.0714603 -0.0139391 0.1032777 -0.0068113 0.0776917 -0.1284409 -0.0102548 -0.0305151 0.0282727 0.0747548 0.0320365 -0.029307 0.0434923 -0.0418538 0.0490475 0.0793768 0.0559737 0.0183883 -0.1139626 -0.0458167 -0.0883656 -0.0939587 -0.0637085 0.0184779 -0.0709641 -0.1115505 -0.1064328 -0.062338 0.0114156 -0.0256315 0.0600722 -0.0167224 0.0132758 0.0598668 0.1022846 0.12115 -0.1149763 0.1479367 0.0220613 0.0003513 -0.0590396 0.2509723 0.1863624 0.0360806 0.0972567 0.0607676 0.0347261 -0.0226424 -0.0476147 -0.1869997 0.3358048 -0.0683335 -0.0580381 -0.0380221 0.1008756 0.2025403 -0.0740783 0.0703316 -0.1240608 0.2599591 0.0892668 0.1042799 0.0949584 0.3146705 unknown
polarizability: 92.3099527|-0.8226043|70.0907711|0.9663295|-1.6991485|62.9541911 unknown
InChI: InChI=1S/C6H11NO2/c7-5-2-1-4(3-5)6(8)9/h4-5,8H,1-3,7H2
charge 0 multiplicity 1
20 atoms
O  2.920918 -0.550404 0.620999
O  2.093198 1.260831 -0.568363
N  -3.089799 0.671102 0.270612
C  0.522891 -0.311013 0.536977
C  -1.78651 0.250376 -0.263892
C  -0.604989 0.761413 0.620596
C  0.021473 -1.363393 -0.524595
C  -1.513655 -1.28264 -0.394981
C  1.870425 0.249958 0.135034
H  0.65062 -0.831995 1.501848
H  -1.690905 0.698627 -1.272369
H  -0.949171 0.878626 1.664601
H  -0.2535 1.747745 0.276528
H  0.44135 -2.365985 -0.338009
H  0.328693 -1.048146 -1.540334
H  -2.044667 -1.738329 -1.250671
H  -1.852912 -1.795334 0.528515
H  -3.289674 0.31886 1.212887
H  -3.880892 0.54506 -0.367007
H  3.786808 -0.17816 0.298622
