program: Gaussian 09
title: 000124459
version: EM64L-G09RevD.01
frameworkgroup: C1[X(C21H20O6)]
method: RPBEPBE
basis: SDD
operation: Freq
keyword: #pfreq=noraman
keyword: PBEPBE/SDD
title: #p freq=noraman PBEPBE/SDD
converged: YES YES NO NO
title: Mulliken charges:
elementType: O O O O O O C C C C C C C C C C C C C C C C C C C C C H H H H H H H H H H H H H H H H H H H H
charge: -0.169038 -0.301829 -0.375786 -0.398213 -0.260142 -0.254327 -0.662817 0.516120 0.523618 0.058801 -0.067941 0.217547 0.068082 -0.633785 -0.508376 -0.484302 0.191278 0.523182 0.138115 -0.647128 -0.522837 -0.203830 -0.374535 -0.815664 0.250388 -0.227733 -0.670434 0.245393 0.248306 0.278466 0.252875 0.236614 0.225973 0.260261 0.280468 0.228673 0.258049 0.243104 0.226243 0.232884 0.357958 0.382906 0.229051 0.228520 0.212459 0.230721 0.232661
chargesum: 0.00000
title: Mulliken charges with hydrogens summed into heavy atoms:
elementType: O O O O O O C C C C C C C C C C C C C C C C C C C C C
charge: -0.169038 -0.301829 -0.017827 -0.015307 -0.260142 -0.254327 -0.417424 0.516120 0.523618 0.058801 -0.067941 0.217547 0.068082 -0.385479 0.022965 -0.247687 0.191278 0.523182 0.138115 -0.421155 0.017892 0.024843 -0.116486 -0.113433 0.250388 0.229838 0.005407
polarizability: 2.83582924e+02 -7.70331706e+00 3.22338740e+02 4.56293392e+01 1.49005799e+00 1.84609221e+02
1716.lowfreq: -7.8606 -5.9656 -0.0005 -0.0001 0.0004 1.9575 9.2847 18.6059 19.8370
frequency: 8.8655 18.4723 19.8077 24.0804 38.0972 50.5993 54.4917 56.0135 67.4599 81.2940 126.3453 134.0004 138.7846 149.3198 186.0937 193.6487 209.2526 223.0185 233.3943 246.5250 264.7842 282.4019 290.2942 307.7511 314.9642 342.2488 350.7953 403.0487 419.3014 439.5380 453.9483 469.1783 472.7003 490.1754 517.7512 534.8018 544.6911 556.8815 566.1663 575.5448 592.7216 619.5244 642.6153 649.6296 669.5805 696.9554 732.4204 738.9426 779.6911 786.4865 790.8984 798.6524 813.5353 820.7178 839.4903 856.6705 883.0948 891.1417 895.9807 929.7424 969.6870 974.6387 978.4220 984.5578 1000.7978 1012.3171 1024.3714 1036.2690 1039.9352 1045.0971 1067.1464 1095.3756 1113.4381 1122.8402 1133.1081 1135.7638 1162.1408 1172.0971 1179.0700 1192.0485 1206.4572 1221.5084 1233.6295 1239.9412 1248.8820 1269.1278 1294.9873 1300.9914 1308.6977 1329.0373 1348.6420 1352.0572 1365.6157 1397.3955 1400.3652 1401.6826 1401.9574 1418.5814 1431.5649 1441.1909 1447.9968 1460.7864 1463.3757 1468.9446 1473.4404 1474.8434 1486.2590 1493.8139 1548.1619 1581.7011 1593.2511 1616.9950 1629.6133 1631.3991 1644.0930 2667.3279 2968.2478 2980.2303 2996.9387 3000.6216 3010.9573 3025.7026 3027.6568 3060.9487 3069.9610 3078.8543 3090.5831 3093.4194 3105.8882 3108.9526 3120.9714 3124.6722 3147.4762 3176.9662 3535.6007
redmass: 5.1031 1.0417 4.2366 4.2998 4.1428 4.8171 4.1822 4.6072 4.2821 6.0133 4.5634 3.8236 3.3828 2.5075 4.4007 4.4451 4.4657 4.3900 5.0204 1.3307 3.8869 7.7537 5.0632 6.6443 4.5277 4.8750 3.7496 6.1586 1.2954 3.8062 6.4376 4.1361 4.5997 3.4267 4.3702 4.5519 5.8163 3.8373 4.7167 4.3872 4.6590 5.2785 5.2673 4.0961 4.5286 5.2878 3.2243 3.0159 4.8401 3.4764 2.0073 1.1062 2.2473 3.2756 1.7140 2.8392 1.4348 3.8264 2.3227 4.7514 5.1227 1.3127 1.0897 2.2468 2.6616 2.2969 2.6369 3.4687 2.6022 1.5743 2.2203 2.7019 2.2484 3.2843 1.8065 1.5173 1.6594 1.2690 1.7228 1.3035 1.3567 1.4468 1.5572 1.3070 1.1372 1.9702 4.3963 1.4617 2.0846 5.1164 1.5035 3.4622 1.7120 1.4875 4.8312 1.2695 3.6154 2.9864 1.1050 2.5523 1.0876 3.3414 1.0398 1.0895 1.0612 1.2266 1.0690 2.7876 3.6923 4.4426 5.9459 6.2977 9.5901 5.1895 8.2136 1.0716 1.0642 1.0382 1.0359 1.0658 1.0582 1.0869 1.0904 1.0960 1.1067 1.0952 1.0996 1.0985 1.0912 1.1026 1.0917 1.0876 1.0932 1.0966 1.0656
irintensity: 0.8840 0.5016 0.4720 1.2354 0.6983 1.7219 0.7984 0.3112 1.7634 3.6994 0.7029 1.2119 2.0937 5.4792 6.0368 1.1216 5.7236 3.0788 0.0563 1.3951 1.9428 7.4188 11.6446 3.9839 7.9257 6.7176 3.3033 24.3146 108.5305 16.1744 5.4815 3.7818 15.8298 8.5226 1.1163 9.5095 8.0561 19.5160 6.2721 1.2687 4.6328 13.4307 1.6610 1.9761 11.3615 11.0409 16.9750 5.6000 16.3941 27.7314 29.7707 3.7374 6.1237 5.4758 15.3687 44.7260 6.6550 33.0591 22.3060 7.5532 4.1059 12.4390 106.8826 15.2140 0.5561 54.2387 84.0910 19.4775 32.0231 16.2207 93.9273 79.5314 8.6079 23.3966 184.7044 48.1191 204.7887 17.5893 51.8417 4.8823 17.0635 121.7092 102.1469 49.2554 0.6632 189.5125 13.4106 191.6599 106.4015 156.1014 2.8161 79.1022 10.0320 19.5790 10.8993 19.4306 4.4511 61.9352 30.0472 51.5119 39.0463 225.4886 12.1637 20.8822 5.6671 27.3900 13.8863 14.8185 49.1820 105.0998 111.6995 200.5588 170.3715 132.3674 58.8280 335.5756 32.2365 24.8687 21.1859 26.8199 17.6518 7.5873 10.4586 16.4870 7.8433 5.1233 15.5833 29.3317 25.9807 41.7547 7.1752 9.2884 18.6377 12.5092 30.9203
temp: 298.150 k
press: 1.00000 atm
elementType: 8 8 8 8 8 8 6 6 6 6 6 6 6 6 6 6 6 6 6 6 6 6 6 6 6 6 6 1 1 1 1 1 1 1 1 1 1 1 1 1 1 1 1 1 1 1 1
symmnumber: 1
zpe: 949494.6 jmol-1
zpe.correction: 0.361643 hartree
zpe.thermalcorrener: 0.387475 hartree
zpe.thermalcorrenthalpy: 0.388419 hartree
zpe.thermalcorrgfe: 0.300754 hartree
zpe.sumelectzpe: -1261.664587 hartree
zpe.sumelectthermal: -1261.638755 hartree
zpe.sumelectthermalent: -1261.637811 hartree
zpe.sumelectthermalfe: -1261.725476 hartree
dipole: 3.7043 4.3741 3.2806
dipole: 6.6043
quadrupole: -138.6954 -142.2343 -161.1128
quadrupole: -28.5757 -5.8396 -10.0942
quadrupole: 8.6521 5.1132 -13.7653 -28.5757 -5.8396 -10.0942
hfenergy: -1262.0262302 hartree
pointgroup: C01 [X(C21H20O6)]
dipole: 1.6111963 1.4645522 1.4178921 debye
polarizability: 283.2556708|-8.3398732|322.6555161|44.232443|10.3049408|184.6196984 unknown
InChI: InChI=1S/C21H20O6/c1-3-27-17(25)8-7-15(23)18-12-5-4-6-14(22)19(12)21(26)20-13(18)9-11(2)10-16(20)24/h4-6,9-10,18,22,24H,3,7-8H2,1-2H3
charge 0 multiplicity 1
47 atoms
O  0.658371 0.269437 -1.3463
O  -3.603945 -0.525137 -1.632077
O  -4.258453 2.062967 -1.398423
O  -3.534532 -3.009488 -1.271173
O  5.739468 -0.450984 -0.834152
O  4.956453 0.947235 0.856993
C  -0.308754 0.079187 0.9196
C  -1.253257 1.231929 0.632026
C  -0.93226 -1.301474 0.792851
C  -2.365356 1.048059 -0.246929
C  -2.018125 -1.467323 -0.112895
C  0.874913 0.114377 -0.122431
C  -2.691972 -0.310553 -0.737547
C  -0.954959 2.496056 1.175912
C  2.271498 -0.048725 0.463632
C  -0.383107 -2.414451 1.457699
C  -3.155755 2.200253 -0.558401
C  -1.740125 3.633848 0.862397
C  -2.516885 -2.793811 -0.376752
C  -2.837694 3.466047 -0.007548
C  3.361138 -0.258695 -0.599463
C  -0.907881 -3.711393 1.214601
C  -1.95537 -3.908109 0.299391
C  -1.3968 4.995946 1.43342
C  4.73118 0.152998 -0.088689
C  7.145365 -0.074918 -0.476608
C  8.059634 -0.853495 -1.416095
H  0.13915 0.198723 1.922537
H  -0.097045 2.604208 1.850572
H  2.502091 0.864887 1.052934
H  2.258892 -0.873359 1.202009
H  0.439998 -2.280656 2.168693
H  -3.4620 4.333611 -0.262839
H  3.396662 -1.301318 -0.957231
H  3.121263 0.354557 -1.490876
H  -0.485853 -4.574012 1.742058
H  -2.358803 -4.902028 0.086878
H  -0.51409 5.425528 0.921811
H  -2.22903 5.710713 1.31778
H  -1.148473 4.929618 2.507852
H  -4.715307 2.936928 -1.507702
H  -3.78315 -2.07364 -1.660702
H  7.249148 1.019292 -0.590927
H  7.310381 -0.327372 0.586369
H  9.11524 -0.609277 -1.1978
H  7.921383 -1.940889 -1.29051
H  7.85405 -0.596199 -2.469044
