program: Gaussian 09
title: 000124419
version: EM64L-G09RevD.01
frameworkgroup: C1[X(C14H16N2O7S)]
method: RPBEPBE
basis: SDD
operation: Freq
keyword: #p
keyword: freq=noraman
keyword: PBEPBE/SDD
title: #p freq=noraman PBEPBE/SDD
converged: YES YES NO NO
title: Mulliken charges:
elementType: S O O O O O O O N N C C C C C C C C C C C C C C H H H H H H H H H H H H H H H H
charge: 0.998960 -0.181821 -0.259968 -0.464764 -0.513383 -0.215325 -0.194214 -0.190488 -0.449321 0.027600 -0.222777 -0.191171 0.207916 -0.392706 0.284465 -0.681546 -0.055314 -0.229479 -0.161181 -0.264855 -0.329492 -0.340122 0.395213 -0.655395 0.290137 0.292130 0.212057 0.234181 0.227727 0.219119 0.227014 0.298527 0.303438 0.236945 0.225532 0.299921 0.302000 0.217108 0.258770 0.234564
chargesum: 0.00000
title: Mulliken charges with hydrogens summed into heavy atoms:
elementType: S O O O O O O O N N C C C C C C C C C C C C C C
charge: 0.998960 -0.181821 -0.259968 -0.464764 -0.513383 -0.215325 -0.194214 -0.190488 -0.449321 0.027600 0.067361 0.100959 0.207916 0.053532 0.284465 -0.007686 -0.055314 0.069047 0.142257 0.197622 -0.029571 -0.038122 0.395213 0.055046
polarizability: 2.89745082e+02 -1.25593854e+01 1.95477926e+02 -3.80524470e-01 1.80851000e+01 1.91535169e+02
1716.lowfreq: -5.6635 -4.7882 -0.0008 -0.0004 0.0015 4.1180 13.8830 14.8958 19.7760
frequency: 13.3631 14.4784 19.5217 25.4882 42.8455 49.1640 62.3982 64.9342 73.6207 89.9471 99.1444 111.4995 119.4066 127.2486 154.3933 180.5166 197.0335 199.5433 219.7564 234.2169 239.7163 260.4700 275.7759 293.2497 309.9927 336.5397 358.6685 370.4331 385.5099 407.4611 413.1986 443.5585 481.1621 503.6035 506.6435 540.4662 611.4828 646.8309 660.0808 666.4693 679.4980 687.1976 734.1924 742.2712 774.1198 781.9545 801.4796 814.4418 820.1739 846.4040 860.6017 871.8217 886.6768 920.9053 960.8069 980.1226 986.9003 991.9026 1001.0612 1003.0811 1043.4834 1047.7508 1054.6144 1068.4269 1085.6346 1095.8782 1106.3541 1109.3597 1117.7191 1147.6137 1158.6352 1174.3619 1181.0350 1207.6104 1216.9461 1242.3506 1274.6584 1286.4992 1291.2796 1324.7052 1341.3717 1357.3557 1371.8300 1391.1136 1396.0445 1396.5668 1423.4608 1452.7660 1458.5021 1462.4367 1468.2960 1478.6075 1482.1605 1483.5097 1579.5074 1606.2798 1645.0156 1731.9600 2981.4862 2990.8042 2998.2995 3031.1589 3032.7248 3047.8288 3078.7445 3084.8489 3086.7978 3094.4069 3098.9524 3124.2902 3159.5231 3165.3646 3188.3765 3191.4099
redmass: 5.3828 5.9632 5.0313 5.6779 3.5657 6.2866 6.0829 6.4836 4.2700 5.3615 4.1148 6.2161 7.1576 3.8442 2.6237 2.8321 9.1431 2.0001 2.3432 2.8699 3.8972 4.1175 5.3796 4.9312 3.7978 5.5658 4.4371 6.6302 7.4491 3.1287 7.0501 3.5377 6.4914 6.2156 6.5384 4.7625 7.1004 7.2728 4.7629 5.9490 8.6805 3.9902 4.2861 6.6087 1.3683 9.7670 1.6562 14.3559 2.1980 1.2890 3.2132 1.5020 2.2518 4.1899 14.7489 2.6842 1.4730 4.3886 1.3737 2.7652 2.3445 3.4604 2.3642 2.5253 4.0350 2.1627 1.6369 1.5469 2.1386 2.8153 1.7238 1.2508 1.4318 1.6283 7.9470 1.3960 1.1222 1.2509 1.2694 1.4780 1.5392 1.4421 6.4041 5.7716 1.2212 1.2040 6.6343 2.1169 1.0835 1.0511 1.0682 1.0438 1.0536 1.0590 6.1283 8.3898 9.2972 12.7857 1.0359 1.0614 1.0364 1.0599 1.0888 1.0967 1.1003 1.0994 1.0885 1.0977 1.1034 1.1056 1.0910 1.0913 1.0951 1.0961
irintensity: 0.3652 0.3487 1.6377 0.0371 0.4966 1.1848 0.2052 0.2260 0.8208 3.2966 1.9574 2.1835 6.9173 1.3037 0.9083 2.1755 7.6708 0.6107 1.5109 1.3661 9.2929 0.7615 0.7245 1.5508 15.2535 12.5870 0.5804 7.0173 38.9263 6.1206 49.7932 4.6033 34.5301 56.5462 58.6582 6.9737 0.2766 2.1425 25.7349 14.4485 27.9355 31.3743 4.7937 2.8178 2.4495 44.0726 3.4600 77.2693 13.4896 3.6503 3.8761 39.0777 1.4920 4.3253 55.7134 12.5205 6.9310 5.4164 0.4833 39.0188 40.1036 94.7105 97.5322 82.2358 6.0169 50.9738 38.6276 6.9463 88.5020 128.0580 37.1736 15.1774 40.2050 18.8026 247.2287 1.1612 6.1837 0.2785 5.2618 26.2521 6.7552 8.5996 50.1318 56.3888 24.3498 9.3433 52.5041 10.4216 14.6379 12.6442 5.9682 13.7584 19.8274 14.6607 27.0288 0.7798 128.1581 412.2309 26.0581 15.9599 14.2444 33.0769 0.6370 3.1767 43.2628 36.7874 8.3785 34.6288 1.4217 27.0679 6.1805 5.2951 3.6746 3.0354
temp: 298.150 k
press: 1.00000 atm
elementType: 16 8 8 8 8 8 8 8 7 7 6 6 6 6 6 6 6 6 6 6 6 6 6 6 1 1 1 1 1 1 1 1 1 1 1 1 1 1 1 1
symmnumber: 1
zpe: 760060.3 jmol-1
zpe.correction: 0.289492 hartree
zpe.thermalcorrener: 0.314821 hartree
zpe.thermalcorrenthalpy: 0.315766 hartree
zpe.thermalcorrgfe: 0.228901 hartree
zpe.sumelectzpe: -1575.160295 hartree
zpe.sumelectthermal: -1575.134965 hartree
zpe.sumelectthermalent: -1575.134021 hartree
zpe.sumelectthermalfe: -1575.220885 hartree
dipole: 4.4367 1.6959 -4.3947
dipole: 6.4710
quadrupole: -159.4831 -145.9269 -156.9131
quadrupole: 7.9437 -15.9291 1.6279
quadrupole: -5.3754 8.1808 -2.8054 7.9437 -15.9291 1.6279
hfenergy: -1575.4497866 hartree
pointgroup: C01 [X(C14H16N2O7S1)]
dipole: -1.4410565 0.2361997 -2.085451 debye
polarizability: 285.8151502|-18.0954474|211.1013284|10.0964034|-13.4831031|179.8416988 unknown
InChI: InChI=1S/C14H16N2O7S/c1-3-11-12(14(18)23-4-2)15(13(11)17)24(21,22)10-7-5-9(6-8-10)16(19)20/h5-8,11-12H,3-4H2,1-2H3
charge 0 multiplicity 1
40 atoms
S  -0.060385 0.878025 1.315757
O  -0.312282 -2.704456 0.962963
O  -3.574741 1.386614 -1.336658
O  -0.3386 0.640174 2.888776
O  -0.436142 2.27152 0.564785
O  -3.835201 0.276282 0.708251
O  6.449244 0.399338 -0.656794
O  6.375367 -1.338394 0.819772
N  -0.924106 -0.440049 0.295864
N  5.833888 -0.352063 0.191383
C  -2.053206 -1.844541 -0.78682
C  -1.948704 -0.261582 -0.786253
C  -0.954037 -1.856586 0.327255
C  -1.716319 -2.572872 -2.09534
C  -3.207815 0.480554 -0.353979
C  -2.826711 -2.406108 -3.156056
C  1.758554 0.475699 0.958396
C  2.432188 1.300581 0.043371
C  2.343867 -0.604392 1.639679
C  -4.766573 2.251101 -1.039513
C  3.791945 1.024872 -0.209517
C  3.702911 -0.878898 1.380879
C  4.396549 -0.060183 0.46222
C  -4.339467 3.471083 -0.220465
H  -3.017399 -2.174949 -0.3591
H  -1.536725 0.174451 -1.708506
H  -0.751711 -2.199085 -2.491136
H  -1.567511 -3.644794 -1.863799
H  -2.55739 -2.931656 -4.089187
H  -3.786238 -2.822795 -2.798213
H  -2.991861 -1.341329 -3.404048
H  1.911802 2.135667 -0.436452
H  1.764708 -1.2120 2.341829
H  -5.514038 1.640863 -0.502517
H  -5.13942 2.523731 -2.039248
H  4.381845 1.627283 -0.904663
H  4.223254 -1.704912 1.871538
H  -5.207156 4.141856 -0.080326
H  -3.970637 3.170385 0.773953
H  -3.543247 4.033662 -0.736281
