program: Gaussian 09
title: 000124345
version: EM64L-G09RevD.01
frameworkgroup: C1[X(C9H13N3O5)]
method: RPBEPBE
basis: SDD
operation: Freq
keyword: #p
keyword: freq=noraman
keyword: PBEPBE/SDD
title: #p freq=noraman PBEPBE/SDD
converged: YES YES NO NO
title: Mulliken charges:
elementType: O O O O O N N N C C C C C C C C C H H H H H H H H H H H H H
charge: -0.302333 -0.488641 -0.458207 -0.441026 -0.343737 -0.411787 -0.050619 -0.613254 -0.224127 -0.153958 -0.103825 0.013427 0.209204 -0.372240 0.180404 -0.393886 0.175019 0.230667 0.216607 0.238764 0.267899 0.197502 0.197350 0.395235 0.375004 0.302512 0.342947 0.333387 0.357563 0.324149
chargesum: 0.00000
title: Mulliken charges with hydrogens summed into heavy atoms:
elementType: O O O O O N N N C C C C C C C C C
charge: -0.302333 -0.093406 -0.083203 -0.098079 -0.343737 -0.078400 -0.050619 0.068458 0.006539 0.062649 0.134939 0.281326 0.209204 0.022612 0.180404 -0.091374 0.175019
polarizability: 1.88352210e+02 1.01525491e+01 1.45897130e+02 -3.73557598e+00 -1.70810087e+00 7.97424490e+01
1716.lowfreq: -4.2624 -0.0013 -0.0012 -0.0012 2.1139 6.0520 22.8118 50.6304 62.6484
frequency: 22.5297 50.6143 62.6398 82.3830 106.3063 137.9972 177.5235 191.1689 205.5140 214.4502 261.7679 279.7043 304.7307 309.8058 326.7115 337.3506 363.3873 413.0852 431.4621 489.1865 530.5392 536.9855 540.2441 561.3064 568.4771 594.0020 631.6131 687.1442 697.3742 715.7445 762.3686 766.8708 778.2984 826.8349 852.3099 887.9802 956.1916 962.2084 973.2825 983.1025 1002.7218 1010.1273 1026.4921 1030.2957 1055.7194 1064.5855 1096.5267 1154.7145 1178.4553 1213.1167 1222.5482 1241.5209 1245.1820 1252.9001 1272.0091 1286.5948 1298.5506 1307.4823 1316.6733 1334.2071 1341.0196 1352.9575 1385.6593 1419.1138 1421.5896 1458.8842 1471.1717 1548.0693 1577.5376 1609.0523 1633.9884 2930.6025 2937.5065 2971.1925 2994.2332 2995.1790 3037.5016 3144.2307 3183.0978 3382.6326 3494.9641 3554.8145 3570.8820 3705.3359
redmass: 5.8543 6.1246 6.7018 5.5434 3.7111 5.8157 3.5650 4.0574 2.7216 1.8038 5.2589 6.1108 1.2800 4.1015 5.9246 4.6762 5.1127 3.6001 2.5317 2.8313 4.7839 1.6801 2.6965 5.4624 1.2789 4.4340 4.9429 3.2933 4.5413 2.0304 5.6251 2.1640 1.5721 3.8238 4.2655 3.6777 2.2194 2.2944 3.5873 5.0360 2.4774 2.7535 1.9445 4.5401 4.0892 3.1064 2.1673 4.1296 1.2020 1.0939 1.2843 1.5304 1.3407 1.5877 1.2091 2.6818 1.2778 1.5936 1.2232 1.2110 1.8205 2.0139 1.5782 1.5949 1.5330 1.0808 4.0879 4.8212 2.2706 4.3291 1.8759 1.0807 1.0556 1.0850 1.1038 1.0877 1.0869 1.0690 1.0934 1.0638 1.0774 1.0456 1.0666 1.1052
irintensity: 1.9095 2.5393 1.8112 5.7968 6.5132 5.3664 31.4986 22.4572 43.7403 68.3371 18.7381 15.8522 50.0630 12.7613 2.3537 5.3311 8.6592 16.5808 78.6647 44.3716 21.9747 139.6460 40.6473 7.3754 141.4114 18.2211 50.3189 33.8436 5.4787 16.3334 7.4069 5.3423 182.8702 50.4594 3.6945 28.1965 8.5156 20.5263 70.4184 70.9634 36.8166 39.2712 13.1055 28.5568 87.2960 16.2524 8.3560 9.3982 9.0922 11.4735 25.0745 14.3439 32.9155 36.0740 26.1866 6.9451 40.2027 187.9502 16.4390 33.9918 13.8401 4.2778 53.1338 45.9844 231.4013 7.5089 29.7912 7.8210 176.5542 576.8946 471.7859 19.2053 43.7407 27.8117 43.6687 97.2886 34.9313 603.2738 3.8624 50.4627 23.5858 150.3009 3.4487 50.5305
temp: 298.150 k
press: 1.00000 atm
elementType: 8 8 8 8 8 7 7 7 6 6 6 6 6 6 6 6 6 1 1 1 1 1 1 1 1 1 1 1 1 1
symmnumber: 1
zpe: 605985.3 jmol-1
zpe.correction: 0.230808 hartree
zpe.thermalcorrener: 0.246940 hartree
zpe.thermalcorrenthalpy: 0.247885 hartree
zpe.thermalcorrgfe: 0.186551 hartree
zpe.sumelectzpe: -889.826611 hartree
zpe.sumelectthermal: -889.810478 hartree
zpe.sumelectthermalent: -889.809534 hartree
zpe.sumelectthermalfe: -889.870868 hartree
dipole: -7.2938 -1.9337 3.2749
dipole: 8.2258
quadrupole: -60.1682 -109.2626 -100.0957
quadrupole: -7.7147 8.1685 -6.8428
quadrupole: 29.6739 -19.4204 -10.2535 -7.7147 8.1685 -6.8428
hfenergy: -890.0574184 hartree
pointgroup: C01 [X(C9H13N3O5)]
dipole: -2.9460535 0.5405114 -1.225623 debye
polarizability: 189.9725328|-6.0796756|144.3456024|2.1142104|1.6288879|79.6736538 unknown
InChI: InChI=1S/C9H13N3O5/c10-9-11-1-3(8(16)12-9)7-6(15)5(14)4(2-13)17-7/h1,4-7,12-15H,2,10H2
charge 0 multiplicity 1
30 atoms
O  1.227129 1.104587 0.446412
O  1.209942 -2.426894 -0.581352
O  3.374598 -1.480569 0.510952
O  3.294282 3.180941 0.146002
O  -1.421843 -2.353086 -0.091392
N  -3.170514 -0.822625 -0.095952
N  -2.877114 1.538984 0.134302
N  -5.029803 0.660388 -0.160291
C  1.293575 -0.982616 -0.7030
C  2.77225 -0.562781 -0.450059
C  0.546654 -0.199206 0.419419
C  2.679624 0.850118 0.186011
C  -0.932389 0.028269 0.21901
C  3.224929 1.973552 -0.687172
C  -1.783325 -1.123251 0.011331
C  -1.521117 1.29416 0.265683
C  -3.67294 0.471337 -0.036546
H  0.949427 -0.63167 -1.6970
H  3.353584 -0.567121 -1.394184
H  0.722307 -0.750352 1.372026
H  3.218648 0.834394 1.151498
H  2.559874 2.122564 -1.564437
H  4.238084 1.681933 -1.040746
H  0.241504 -2.655407 -0.387937
H  2.886485 -2.346185 0.378434
H  -0.88806 2.172042 0.415345
H  3.569288 3.950637 -0.412272
H  -3.774612 -1.638935 -0.240917
H  -5.360962 1.621514 -0.10975
H  -5.694605 -0.09882 -0.278517
