program: Gaussian 09
title: 000124305
version: EM64L-G09RevD.01
frameworkgroup: C1[X(C14H19N3O8)]
method: RPBEPBE
basis: SDD
operation: Freq
keyword: #p
keyword: freq=noraman
keyword: PBEPBE/SDD
title: #p freq=noraman PBEPBE/SDD
converged: YES YES NO NO
title: Mulliken charges:
elementType: O O O O O O O O N N N C C C C C C C C C C C C C C H H H H H H H H H H H H H H H H H H H
charge: -0.325505 -0.445074 -0.432508 -0.433624 -0.302030 -0.233650 -0.416625 -0.225294 -0.195681 -0.062951 -0.408823 -0.142823 -0.164394 -0.088436 -0.056288 -0.352991 -0.100007 0.079829 -0.288652 0.200201 -0.545012 0.226173 -0.360560 -0.473905 0.179088 0.247263 0.239917 0.288797 0.255273 0.244418 0.196074 0.386736 0.365308 0.296793 0.348993 0.313214 0.341410 0.224807 0.244877 0.259333 0.237169 0.247863 0.251600 0.379697
chargesum: 0.00000
title: Mulliken charges with hydrogens summed into heavy atoms:
elementType: O O O O O O O O N N N C C C C C C C C C C C C C C
charge: -0.325505 -0.058338 -0.067199 -0.084630 -0.302030 -0.233650 -0.036928 -0.225294 -0.195681 -0.062951 -0.067413 0.104440 0.075523 0.200361 0.198985 0.087500 0.196786 0.079829 0.024562 0.200201 -0.075328 0.226173 0.135942 0.025558 0.179088
polarizability: 3.11355023e+02 -1.01639965e+01 1.90045504e+02 1.16806692e+01 1.26312357e+00 1.30419090e+02
1716.lowfreq: -5.0583 -1.4051 -0.0011 0.0004 0.0010 4.5754 9.3609 17.1896 22.5153
frequency: 8.5161 17.1855 22.5017 36.5380 45.1384 49.5562 66.9920 73.1467 80.8135 88.1604 95.6789 110.7944 129.9401 157.8985 158.3097 184.2908 201.1690 237.0671 250.9145 254.2839 265.5463 293.9997 322.9582 333.8732 351.3455 369.3898 379.5192 410.5750 433.2964 441.4218 450.9520 481.7587 506.4443 536.5350 540.1477 565.4029 571.6565 581.9103 588.5675 623.3618 642.6591 650.3165 677.4224 712.5712 717.6834 743.3464 748.5905 769.2001 783.8871 794.3160 818.5392 844.2296 851.5554 868.0997 915.7776 954.3945 966.5455 979.3307 987.8251 992.7784 1015.9076 1020.8570 1021.5246 1036.6421 1051.6038 1056.6246 1061.1296 1072.5198 1079.4596 1086.9922 1114.0696 1126.6175 1146.0480 1162.8110 1178.6430 1179.7873 1189.2923 1229.5378 1237.8902 1243.4173 1254.6597 1260.5719 1269.7591 1280.5714 1284.7974 1290.5126 1298.1964 1314.2692 1331.1811 1344.4703 1349.9197 1362.5632 1377.3202 1381.6272 1393.0412 1400.3309 1418.3297 1438.9179 1446.1861 1454.4112 1468.2656 1481.2946 1532.1796 1575.9877 1621.1987 1633.3833 1671.3221 2960.7794 2968.2657 2968.9296 2979.6912 2984.8731 3019.1180 3021.4725 3025.7322 3034.3964 3041.8749 3089.3300 3094.0717 3186.7966 3227.1774 3340.0566 3501.4253 3512.7937 3560.2338 3573.9961
redmass: 7.6742 9.7282 6.4456 7.5136 6.3683 3.6376 6.8856 2.6431 3.5816 3.7176 5.9999 6.6144 4.8601 3.4913 4.2947 4.6614 7.2923 5.0764 6.5431 6.1280 6.1355 5.8765 5.6769 7.2239 4.0774 1.2840 3.9822 1.4687 2.7651 3.2111 4.0554 3.9996 1.9148 5.2582 4.3780 3.9949 5.2150 5.7264 5.6361 4.6745 1.3864 5.5661 2.6980 4.0592 1.1098 1.4234 3.0500 1.9645 4.4343 4.1725 3.7987 1.4189 1.7875 3.8237 5.1107 4.2097 5.3995 4.5548 1.5387 2.4601 3.8659 3.5737 3.2988 3.3380 3.2812 2.0284 3.4801 3.0556 3.2889 2.3203 2.1085 1.8213 2.2312 1.9896 1.7448 1.2717 1.2903 1.1331 1.4013 1.2862 1.2871 1.4853 1.3328 1.2574 1.3380 1.4484 1.3342 1.3627 1.3979 1.2217 1.5509 1.8521 1.8150 1.3220 1.6964 3.4410 1.6359 1.0923 1.0889 1.0835 2.9129 1.0867 3.4255 6.7415 7.9238 6.5803 8.4085 1.0832 1.0603 1.0689 1.0849 1.0631 1.0850 1.0703 1.0897 1.0866 1.0958 1.1034 1.0960 1.0923 1.0974 1.0643 1.0762 1.0640 1.0659 1.0662
irintensity: 0.3358 1.1346 0.0799 0.6365 1.7350 0.0650 7.1385 2.2530 1.6098 0.9775 5.6605 1.1395 4.5454 4.0732 1.2258 5.0613 2.8794 5.5719 9.3804 36.8365 1.7974 5.9904 0.3898 11.0992 24.1661 131.5546 5.9083 227.6507 24.3289 33.6467 47.9312 2.9491 31.4902 2.3753 3.8163 14.2496 22.4103 4.5262 14.9077 6.5937 111.0206 24.0192 25.4687 2.9614 159.0375 8.1021 0.4553 74.7157 13.8338 0.2759 40.9519 55.8470 16.1129 4.8843 18.4918 55.1741 69.7545 193.4874 6.7043 34.9259 6.3463 89.6579 152.8945 17.5984 71.5050 40.3449 44.9285 53.0713 194.2169 75.3610 4.8026 81.0694 41.0077 24.4566 36.5291 12.4683 14.8195 52.9702 15.6616 53.1352 12.5342 95.3287 51.9310 53.7857 15.9362 113.2279 187.6990 34.2876 44.7219 33.1056 65.0896 148.8999 59.8290 10.4531 178.2892 38.6742 88.6943 10.3083 27.4980 9.2263 747.1737 17.9766 111.4967 142.5748 576.2624 159.5757 216.5414 13.0996 12.8277 28.7055 46.2890 12.0576 35.1112 10.7197 12.7134 12.4028 3.5638 22.5405 13.2705 8.8809 15.8884 243.7743 34.2192 24.4013 8.2354 21.8564
temp: 298.150 k
press: 1.00000 atm
elementType: 8 8 8 8 8 8 8 8 7 7 7 6 6 6 6 6 6 6 6 6 6 6 6 6 6 1 1 1 1 1 1 1 1 1 1 1 1 1 1 1 1 1 1 1
symmnumber: 1
zpe: 885680.9 jmol-1
zpe.correction: 0.337338 hartree
zpe.thermalcorrener: 0.362338 hartree
zpe.thermalcorrenthalpy: 0.363282 hartree
zpe.thermalcorrgfe: 0.277520 hartree
zpe.sumelectzpe: -1309.042267 hartree
zpe.sumelectthermal: -1309.017267 hartree
zpe.sumelectthermalent: -1309.016323 hartree
zpe.sumelectthermalfe: -1309.102085 hartree
dipole: -3.1307 -1.4694 -1.6925
dipole: 3.8503
quadrupole: -125.4554 -172.9617 -146.9352
quadrupole: 9.3792 3.2714 -5.9953
quadrupole: 22.9954 -24.5110 1.5156 9.3792 3.2714 -5.9953
hfenergy: -1309.379605 hartree
pointgroup: C01 [X(C14H19N3O8)]
dipole: 1.2199926 0.7151994 -0.5430034 debye
polarizability: 312.3417507|-3.99946|188.6561121|-8.9136714|6.9762513|130.8217545 unknown
InChI: InChI=1S/C14H19N3O8/c18-6-7-11(22)12(23)13(25-7)17-5-4-8(16-14(17)24)15-9(19)2-1-3-10(20)21/h4-5,7,11-13,15,18,20,22-23H,1-3,6H2
charge 0 multiplicity 1
44 atoms
O  -4.00389 -0.98872 -0.924889
O  -4.847851 2.038282 0.832421
O  -5.825827 -0.686807 2.228915
O  -5.195405 -3.621073 -1.151247
O  -2.304097 2.668693 0.13068
O  2.937725 -1.139027 -0.712206
O  9.26149 -0.029766 0.609718
O  7.755467 -1.426146 1.694369
N  -2.084793 0.40797 -0.444754
N  -0.137491 1.784914 -0.071373
N  2.002279 0.957056 -0.224577
C  -4.294746 0.705914 0.797886
C  -5.437745 -0.32647 0.873389
C  -3.585649 0.356449 -0.550921
C  -4.850449 -1.56646 0.182706
C  -5.857539 -2.50496 -0.472744
C  -1.293689 -0.687723 -0.691086
C  -1.515429 1.697685 -0.10981
C  0.0899 -0.598893 -0.627601
C  0.624408 0.694357 -0.312949
C  4.458472 0.746722 -0.300706
C  3.084315 0.081551 -0.426383
C  5.507574 -0.20554 0.313914
C  6.924868 0.389659 0.222118
C  7.964013 -0.46584 0.923081
H  -3.589837 0.525607 1.638583
H  -6.296003 0.080146 0.296444
H  -3.886686 1.069907 -1.340107
H  -4.197094 -2.122636 0.882851
H  -6.489315 -2.961513 0.306446
H  -6.498757 -1.928812 -1.173126
H  -4.067514 2.650267 0.670529
H  -6.201542 0.11637 2.670251
H  -1.825387 -1.607958 -0.943164
H  -4.625118 -3.244715 -1.869453
H  0.739105 -1.452144 -0.813133
H  2.198916 1.935447 0.013695
H  4.390497 1.685281 0.283533
H  4.77523 1.032015 -1.325793
H  5.463349 -1.17461 -0.212674
H  5.259477 -0.416714 1.369645
H  6.966695 1.397379 0.683879
H  7.242034 0.526848 -0.828934
H  9.92354 -0.59249 1.096478
