program: Gaussian 09
title: 000124289
version: EM64L-G09RevD.01
frameworkgroup: C1[X(C17H19N9)]
method: RPBEPBE
basis: SDD
operation: Freq
keyword: #pfreq=noraman
keyword: PBEPBE/SDD
title: #p freq=noraman PBEPBE/SDD
converged: YES YES NO NO
title: Mulliken charges:
elementType: N N N N N N N N N C C C C C C C C C C C C C C C C C H H H H H H H H H H H H H H H H H H H
charge: 0.047837 -0.660776 -0.661832 -0.134594 -0.389868 -0.390015 -0.383769 -0.093818 -0.654183 0.349486 0.463148 0.348547 -0.524316 0.443316 -0.512010 -0.341900 -0.377722 -0.344370 -0.379449 -0.241905 -0.243655 0.083878 0.082355 -0.398966 -0.383257 0.284357 0.288845 0.293649 0.191288 0.285994 0.189479 0.249076 0.228133 0.222095 0.207760 0.246039 0.314549 0.313798 0.313452 0.311780 0.270386 0.213030 0.211864 0.299944 0.362320
chargesum: 0.00000
title: Mulliken charges with hydrogens summed into heavy atoms:
elementType: N N N N N N N N N C C C C C C C C C C C C C C C C C
charge: 0.047837 -0.032430 -0.036601 -0.134594 -0.119482 -0.176985 -0.171905 -0.093818 0.008080 0.349486 0.463148 0.348547 -0.235471 0.443316 -0.218361 -0.150611 -0.091728 -0.154891 -0.130373 -0.013773 -0.021560 0.083878 0.082355 -0.191206 -0.137218 0.284357
polarizability: 6.23410808e+02 -1.12865005e+01 3.17034065e+02 6.32945079e-02 3.55379931e-02 9.89228837e+01
1716.lowfreq: -73.0858 -61.5789 -57.6295 -4.8666 -2.8071 -2.6062 -0.0011 0.0003 0.0013
frequency: -73.0774 -61.5746 -57.6255 14.8111 17.9275 20.8262 53.8267 58.8556 87.8968 101.6744 120.5810 151.3135 155.6302 168.7418 174.7071 219.5073 239.5265 248.4411 270.4906 274.4845 301.4172 301.8966 341.2888 369.8330 374.8366 376.5254 383.8254 418.9977 420.3985 420.5552 430.8399 437.1733 446.6507 484.5563 501.8341 530.8500 537.2948 552.5724 555.2935 560.3607 562.7831 624.7747 627.4013 651.7229 685.3589 687.2595 697.0024 697.4083 699.7922 704.5124 745.1724 752.9461 798.7324 801.5525 815.5610 818.3625 889.1730 899.7920 907.9648 908.7898 920.9467 927.1637 941.9361 969.8577 981.9729 984.9594 986.5631 987.0508 999.7489 1023.9282 1036.2278 1037.7061 1072.7761 1076.8332 1083.7286 1093.9937 1097.0645 1127.8295 1128.3124 1138.8142 1187.0707 1191.0836 1238.8247 1243.1417 1301.0425 1305.5067 1322.0255 1337.4588 1366.6114 1370.8364 1384.5029 1393.8135 1398.3254 1430.4899 1441.0772 1477.7218 1480.0931 1498.1281 1558.6969 1567.1853 1571.1959 1579.7165 1585.8764 1596.7837 1605.3019 1607.0459 1616.0543 1617.1874 1639.8430 1640.1125 2962.5293 3046.6149 3117.2771 3122.6188 3140.2247 3142.1298 3146.5751 3148.8435 3163.8627 3167.9724 3330.1805 3332.0192 3377.9603 3483.6792 3547.5316 3547.5656 3676.1437 3689.8884 3690.2307
redmass: 1.9025 3.4483 3.1113 5.5847 6.3097 4.6539 4.6240 5.7998 3.6281 6.3606 6.0542 4.7079 6.0415 3.8482 4.2069 5.9265 2.5378 5.1201 1.9830 4.0395 3.1569 4.8244 2.0350 1.3508 1.8812 4.8430 4.9040 2.0861 3.0428 4.7914 4.5882 1.4333 1.2471 4.3911 4.0612 2.4777 3.5042 5.1808 1.4802 3.0599 3.1325 6.5059 2.4048 5.7431 2.7699 3.6599 5.7444 2.1107 1.8355 1.6386 5.2695 5.0047 1.6326 1.5599 1.4651 1.4891 4.6948 1.4298 1.3899 3.4383 1.5044 4.2587 1.4325 1.5434 1.5582 1.3611 6.0975 6.1540 1.3549 2.3964 1.5679 1.5553 1.7655 1.7721 3.0359 1.8037 1.6981 1.6681 1.5987 3.4936 1.1218 1.1149 1.9082 1.8101 1.4830 1.4633 1.5016 1.7263 3.1339 3.0663 2.9539 6.9632 4.6277 4.0579 3.8141 2.7977 2.6632 3.4430 1.5086 3.5570 4.4827 3.7497 4.7786 3.7367 4.7226 4.8890 4.6821 4.5871 1.3789 1.3697 1.0868 1.0883 1.0864 1.0864 1.0914 1.0915 1.0919 1.0916 1.0974 1.0980 1.0762 1.0762 1.0745 1.0481 1.0452 1.0452 1.0998 1.1031 1.1031
irintensity: 1.4228 1.8603 49.2827 0.8197 0.6856 1.8060 0.1259 2.4831 0.1380 7.8026 4.7298 0.0860 3.5373 7.7374 3.5281 2.3575 27.9325 1.2176 53.6310 3.6214 58.9177 9.8185 35.2015 107.3679 7.4599 7.1283 1.4506 81.3465 37.0203 51.3337 24.4272 107.1575 169.2155 1.3377 6.9151 15.3688 1.0244 17.3321 144.6432 28.0106 36.9990 5.8235 20.4567 12.1082 14.8422 8.1220 2.5987 11.4391 24.7623 152.2701 6.7240 15.5351 2.0691 6.6296 108.0990 118.2647 7.7232 0.2489 4.1956 52.4497 6.7369 8.5229 0.5238 40.9091 43.9339 1.6608 2.2741 0.7291 1.0136 102.4226 11.6382 13.6931 100.9892 146.1774 95.7506 88.8442 1.9189 56.2322 18.8212 247.9407 2.9013 2.4606 31.4039 27.7128 14.1278 7.8541 86.5082 32.7485 203.9565 169.3558 10.3450 0.2487 2.1210 1.8842 98.3927 365.5977 7.1990 1210.8722 261.0534 74.5718 59.0911 189.4459 75.1909 544.1052 74.4805 0.5525 15.9636 14.2793 264.8903 154.2706 54.9640 18.1506 16.6701 20.2314 36.5043 11.8722 17.3090 3.7431 23.7463 10.4140 37.9783 35.4458 21.4774 64.3405 20.1725 16.1182 68.2886 26.5967 24.0886
temp: 298.150 k
press: 1.00000 atm
elementType: 7 7 7 7 7 7 7 7 7 6 6 6 6 6 6 6 6 6 6 6 6 6 6 6 6 6 1 1 1 1 1 1 1 1 1 1 1 1 1 1 1 1 1 1 1
symmnumber: 1
zpe: 915779.1 jmol-1
zpe.correction: 0.348802 hartree
zpe.thermalcorrener: 0.371636 hartree
zpe.thermalcorrenthalpy: 0.372580 hartree
zpe.thermalcorrgfe: 0.294424 hartree
zpe.sumelectzpe: -1150.054402 hartree
zpe.sumelectthermal: -1150.031567 hartree
zpe.sumelectthermalent: -1150.030623 hartree
zpe.sumelectthermalfe: -1150.108779 hartree
dipole: -0.2037 1.5517 0.0355
dipole: 1.5655
quadrupole: -58.7105 -112.7318 -164.2403
quadrupole: 15.1392 0.0088 -0.0593
quadrupole: 53.1837 -0.8376 -52.3461 15.1392 0.0088 -0.0593
hfenergy: -1150.4032034 hartree
pointgroup: C01 [X(C17H19N9)]
dipole: -0.0789028 -0.6106619 -0.0141562 debye
polarizability: 623.3633138|11.9135379|317.0815072|-0.0847153|0.1046773|98.9229357 unknown
InChI: InChI=1S/C17H19N9/c18-15(19)13-5-1-3-11(7-13)9-23-25-17(22)26-24-10-12-4-2-6-14(8-12)16(20)21/h1-10,18,20,25H,19,21-22H2
charge 0 multiplicity 1
45 atoms
N  -2.09711 -1.205829 0.000306
N  -8.822879 1.772311 -0.004517
N  8.480104 2.231838 -0.004772
N  2.098882 -1.467839 -0.000295
N  -1.374891 -2.37474 -0.000209
N  -8.430345 -0.607596 0.003265
N  6.317398 3.299461 0.006967
N  0.698708 -1.212087 0.000216
N  0.626528 -3.613056 -0.001311
C  -6.51694 0.884681 0.000662
C  -4.253268 -0.100753 0.000771
C  6.414514 0.874294 0.000172
C  -5.661726 -0.244517 0.000316
C  4.291633 -0.395803 -0.000119
C  4.998766 0.833437 0.000792
C  -5.935985 2.179272 0.001756
C  -3.684881 1.207354 0.001653
C  7.132566 -0.350087 -0.00115
C  5.032837 -1.614908 -0.001628
C  -4.527771 2.331475 0.002218
C  6.437808 -1.58401 -0.002055
C  -8.001836 0.641756 -0.000126
C  7.08195 2.223124 0.001006
C  -3.411098 -1.302886 0.000274
C  2.824515 -0.366548 0.000431
C  0.025856 -2.369251 -0.000408
H  -6.139402 -1.230708 -0.000287
H  4.469897 1.792718 0.002048
H  -6.549687 3.087857 0.002944
H  -2.595024 1.308404 0.001976
H  8.228631 -0.378266 -0.000794
H  4.487865 -2.564068 -0.002369
H  -4.093482 3.337127 0.00316
H  7.00498 -2.52165 -0.002973
H  -3.93699 -2.280606 -0.000158
H  2.326713 0.61804 0.001428
H  -9.83444 1.664146 -0.004833
H  -8.448812 2.716894 -0.009086
H  8.980794 3.117396 -0.004094
H  9.030263 1.377823 -0.01149
H  -1.855047 -3.287263 -0.000544
H  -9.467469 -0.691032 0.002079
H  6.854177 4.190909 0.006724
H  0.128904 -4.49768 -0.001546
H  1.648895 -3.567434 -0.0014
