program: Gaussian 09
title: 000124301
version: EM64L-G09RevD.01
frameworkgroup: C1[X(C11H10N2O4)]
method: RPBEPBE
basis: SDD
operation: Freq
keyword: #p
keyword: freq=noraman
keyword: PBEPBE/SDD
title: #p freq=noraman PBEPBE/SDD
converged: YES YES NO NO
title: Mulliken charges:
elementType: O O O O N N C C C C C C C C C C C H H H H H H H H H H
charge: -0.231519 -0.182812 -0.182784 -0.273504 -0.113314 -0.679190 -0.501590 -0.501396 0.214904 0.213692 0.094456 0.230510 0.335354 -0.294273 -0.390117 -0.262529 -0.188656 0.268290 0.267139 0.267307 0.268073 0.270603 0.223476 0.234566 0.229158 0.374748 0.309408
chargesum: 0.00000
title: Mulliken charges with hydrogens summed into heavy atoms:
elementType: O O O O N N C C C C C C C C C C C
charge: -0.231519 -0.182812 -0.182784 -0.273504 -0.113314 0.004966 0.033839 0.033984 0.214904 0.213692 0.094456 0.230510 0.335354 -0.023671 -0.166641 -0.027964 0.040501
polarizability: 2.11543678e+02 8.63637202e+00 1.37463379e+02 -6.35127342e-01 -1.70399260e+00 1.04682919e+02
1716.lowfreq: -8.3049 -1.6743 0.0008 0.0008 0.0009 9.1280 23.2606 32.5348 59.2409
frequency: 23.2157 32.4556 59.2246 67.1168 80.6151 105.2690 143.4743 158.0135 229.8574 255.9646 297.0233 356.8710 372.9789 413.0048 423.5030 458.2969 483.3722 518.5390 533.5796 546.8613 548.7157 557.9061 579.6345 634.0217 650.4441 661.4792 689.3861 702.9331 754.9689 758.6024 770.3682 817.5970 830.0172 856.0622 931.7175 963.7335 986.9375 995.8817 1005.8638 1015.5841 1020.6063 1040.7414 1055.5887 1145.7391 1155.7827 1169.6132 1179.1216 1209.3203 1224.3602 1253.1510 1289.8781 1292.5400 1299.4972 1334.0292 1407.4242 1436.4319 1452.5134 1453.0166 1491.7836 1561.4058 1596.0007 1634.2892 1661.5519 1663.3763 1717.5765 3028.9853 3038.1013 3083.6286 3101.0324 3124.7622 3145.9637 3163.5261 3184.9812 3451.0904 3654.5158
redmass: 5.3974 7.5249 4.6305 2.3717 4.0009 7.9957 5.8975 7.0944 4.4786 6.9793 11.7767 8.3420 8.0225 7.0721 3.0720 3.5947 1.1861 3.0086 3.5436 4.0505 4.4420 3.9579 11.3195 6.2240 7.2982 4.8793 1.1552 6.7561 2.6573 12.2499 1.5617 1.4964 5.5257 1.5125 7.3668 1.3657 1.3361 3.1071 2.1766 5.6268 2.1348 5.5390 1.7254 1.1952 1.3133 11.6923 1.0597 1.1101 3.3136 3.1431 1.8022 1.4877 2.7474 1.8844 6.5073 1.0738 2.3763 1.1801 2.7027 3.7158 3.1111 2.8834 3.5395 12.5069 12.5552 1.0593 1.0629 1.1038 1.1020 1.0868 1.0925 1.0932 1.0982 1.0528 1.0976
irintensity: 0.6644 3.5342 4.5280 0.0986 0.0172 10.3636 0.2232 0.0161 3.3856 9.9569 0.1223 4.1397 18.1675 1.4207 13.1227 5.6236 101.5231 23.2569 0.3077 3.1270 1.8658 0.1679 29.5432 50.6359 0.2042 6.5825 137.1630 26.3831 75.6990 104.8788 22.7010 11.0954 24.7991 3.0777 211.2192 0.9948 0.3019 132.8473 0.1016 3.8720 8.8290 94.2283 10.4268 1.1516 12.8118 231.8228 28.9116 0.0251 31.3800 243.2972 35.4120 1.7068 59.7449 14.3341 12.3867 0.6529 7.0109 24.6815 74.0112 137.5144 168.3671 221.2456 169.2135 594.3048 0.5809 12.4854 2.8519 0.0074 6.5935 6.8904 21.1552 14.9448 7.8690 87.9416 59.7851
temp: 298.150 k
press: 1.00000 atm
elementType: 8 8 8 8 7 7 6 6 6 6 6 6 6 6 6 6 6 1 1 1 1 1 1 1 1 1 1
symmnumber: 1
zpe: 520333.8 jmol-1
zpe.correction: 0.198185 hartree
zpe.thermalcorrener: 0.213172 hartree
zpe.thermalcorrenthalpy: 0.214116 hartree
zpe.thermalcorrgfe: 0.153973 hartree
zpe.sumelectzpe: -834.345006 hartree
zpe.sumelectthermal: -834.330018 hartree
zpe.sumelectthermalent: -834.329074 hartree
zpe.sumelectthermalfe: -834.389217 hartree
dipole: -0.4926 1.6832 -0.1311
dipole: 1.7587
quadrupole: -59.6106 -86.3953 -117.4099
quadrupole: -3.5426 0.1947 -2.3578
quadrupole: 28.1947 1.4100 -29.6047 -3.5426 0.1947 -2.3578
hfenergy: -834.5431904 hartree
pointgroup: C01 [X(C11H10N2O4)]
dipole: -0.1926285 0.5196885 -0.4142275 debye
polarizability: 211.5698406|6.2390011|125.440759|-5.8620621|-15.8646364|116.6793759 unknown
InChI: InChI=1S/C11H10N2O4/c12-8-4-2-1-3-7(8)11(16)17-13-9(14)5-6-10(13)15/h1-4H,5-6,12H2
charge 0 multiplicity 1
27 atoms
O  0.624455 -0.606072 0.503457
O  2.250657 1.261801 2.010764
O  2.21713 -1.703391 -1.655087
O  0.204259 1.21688 -0.941075
N  1.986153 -0.310346 0.252504
N  -2.394904 1.846214 -1.407323
C  4.129001 0.635277 0.46663
C  4.119374 -0.345483 -0.737481
C  2.710712 0.618501 1.048035
C  2.693832 -0.901164 -0.829484
C  -1.669644 -0.012089 0.044071
C  -0.273474 0.308859 -0.218737
C  -2.701084 0.790044 -0.576787
C  -2.034958 -1.097483 0.897457
C  -4.066963 0.45857 -0.305714
C  -3.378206 -1.4021 1.146461
C  -4.393702 -0.611977 0.535564
H  4.372756 1.670601 0.174392
H  4.84073 0.342082 1.257012
H  4.821365 -1.187611 -0.613367
H  4.364274 0.14645 -1.69379
H  -1.238675 -1.690252 1.354831
H  -4.859291 1.058222 -0.769345
H  -3.64557 -2.235887 1.801899
H  -5.448554 -0.842465 0.723893
H  -1.411699 2.067952 -1.58973
H  -3.138075 2.39537 -1.831448
