program: Gaussian 09
title: 000124205
version: EM64L-G09RevD.01
frameworkgroup: C1[X(C13H14N2)]
method: RPBEPBE
basis: SDD
operation: Freq
keyword: #pfreq=noraman
keyword: PBEPBE/SDD
title: #p freq=noraman PBEPBE/SDD
converged: YES YES NO NO
title: Mulliken charges:
elementType: N N C C C C C C C C C C C C C H H H H H H H H H H H H H H
charge: -0.137876 -0.101232 -0.157917 -0.432674 -0.417742 0.214369 -0.545153 0.269352 -0.352338 -0.378484 -0.179897 -0.216558 -0.253972 -0.247460 -0.348522 0.223431 0.217718 0.228301 0.218713 0.207667 0.224639 0.227987 0.259762 0.234317 0.275214 0.255646 0.232361 0.229686 0.250661
chargesum: 0.00000
title: Mulliken charges with hydrogens summed into heavy atoms:
elementType: N N C C C C C C C C C C C C C
charge: -0.137876 -0.101232 0.065513 0.013345 0.008639 0.214369 -0.092527 0.269352 -0.092576 -0.144167 0.095317 0.039088 -0.021610 -0.017773 -0.097861
polarizability: 1.75514032e+02 3.64990285e+00 1.44668808e+02 9.91287726e+00 -1.57867190e+00 1.02890736e+02
1716.lowfreq: -2.4853 -0.0008 -0.0006 -0.0003 6.7266 11.4270 43.1898 54.9835 77.5313
frequency: 43.1522 54.9372 77.5176 129.7735 160.2811 258.2751 265.2006 287.5211 310.4701 391.1762 434.3815 441.7220 458.2285 502.3669 579.4369 612.8010 639.9291 655.8366 693.7780 734.0921 750.7899 752.1788 773.8668 784.3330 806.2842 844.9199 865.7599 880.5531 881.7262 902.1298 926.6865 961.7736 992.6169 1004.7268 1012.8113 1040.1421 1051.1346 1070.1900 1100.6383 1107.6018 1114.2244 1144.4995 1173.5882 1178.7193 1202.9421 1210.9434 1215.8409 1232.5122 1245.7691 1259.4911 1279.2473 1310.8608 1327.7358 1333.8338 1342.5835 1350.6946 1376.9825 1383.5421 1439.0685 1446.8018 1455.6435 1470.3746 1472.3377 1475.5015 1487.5195 1589.1466 1613.9974 2960.5739 2967.6287 2981.5797 2993.8813 3025.6748 3049.2868 3059.3777 3114.0433 3128.2301 3141.6098 3161.7848 3223.1842 3225.2428 3252.4139
redmass: 4.4997 3.5993 4.2973 2.8977 3.3130 3.7445 4.8828 1.8847 5.4783 3.8793 3.1655 3.1858 3.1591 3.9150 2.7184 4.0002 3.4894 3.3706 3.4905 1.3059 1.4540 4.1741 1.3887 2.2404 2.8984 1.4080 1.5864 5.7433 1.4228 2.2825 2.3809 1.3954 1.3262 2.8107 2.9054 2.4110 1.6263 1.9460 1.9837 1.7293 1.9379 1.3648 1.3764 1.2113 1.8508 1.8863 1.6502 2.6039 1.2991 1.9677 1.3207 1.4583 2.9722 1.5515 1.9103 1.5116 3.9964 2.5299 2.3447 2.7481 1.1394 2.9449 1.1096 1.2014 2.3101 6.9034 6.3009 1.0651 1.0825 1.0645 1.0614 1.0945 1.0988 1.1035 1.0874 1.0875 1.0937 1.1006 1.0916 1.0967 1.1090
irintensity: 2.6883 0.5864 0.2092 0.1004 0.0973 5.8069 1.7458 0.6427 0.2320 0.6261 3.4446 5.9062 0.1502 0.7061 1.0184 1.5723 4.4777 22.1076 1.5663 18.1613 52.8144 9.8193 76.5164 12.3441 8.7949 1.7143 4.4726 11.6024 2.9351 4.6614 6.9301 1.3447 0.0461 0.8994 22.7833 4.1482 34.2956 2.1391 3.0283 10.0800 2.1805 5.1175 1.3336 1.0883 1.1122 14.2409 16.0096 17.3859 3.0176 28.4228 3.7431 7.1065 3.4441 3.1043 3.0364 0.3598 7.2743 21.6383 8.3703 42.0027 10.3850 7.6969 9.3514 9.7517 22.7689 1.6778 1.8669 25.4254 8.7382 31.0228 26.9924 35.4456 53.2723 37.0857 10.4871 1.7325 25.6144 27.3519 5.8931 0.4165 2.0999
temp: 298.150 k
press: 1.00000 atm
elementType: 7 7 6 6 6 6 6 6 6 6 6 6 6 6 6 1 1 1 1 1 1 1 1 1 1 1 1 1 1
symmnumber: 1
zpe: 631991.1 jmol-1
zpe.correction: 0.240713 hartree
zpe.thermalcorrener: 0.252608 hartree
zpe.thermalcorrenthalpy: 0.253552 hartree
zpe.thermalcorrgfe: 0.201821 hartree
zpe.sumelectzpe: -612.209873 hartree
zpe.sumelectthermal: -612.197978 hartree
zpe.sumelectthermalent: -612.197034 hartree
zpe.sumelectthermalfe: -612.248765 hartree
dipole: 4.6712 1.8698 0.3232
dipole: 5.0419
quadrupole: -105.1992 -82.5252 -85.6056
quadrupole: -2.3267 -0.2855 -1.6431
quadrupole: -14.0892 8.5848 5.5044 -2.3267 -0.2855 -1.6431
hfenergy: -612.4505857 hartree
pointgroup: C01 [X(C13H14N2)]
dipole: -1.8114685 0.7976279 -0.1311612 debye
polarizability: 174.6990366|-5.2260234|144.6544138|11.5770302|3.4428184|103.7201253 unknown
InChI: InChI=1S/C13H14N2/c1-2-6-12-11(4-1)5-3-7-13(12)15-9-8-14-10-15/h1-2,4,6,8-10,13H,3,5,7H2
charge 0 multiplicity 1
29 atoms
N  1.718439 0.11852 0.201577
N  3.868249 -0.605104 0.341903
C  0.434551 0.741779 0.601313
C  0.31015 2.173365 0.026819
C  -1.078016 2.758788 0.355622
C  -0.773709 -0.143558 0.252696
C  -2.18057 1.936451 -0.344718
C  -2.010208 0.430405 -0.157697
C  -0.670227 -1.551102 0.39566
C  -3.109026 -0.428885 -0.417276
C  2.082836 -0.307658 -1.0829
C  2.829547 -0.07852 1.02139
C  -1.769554 -2.392767 0.132813
C  -2.999684 -1.827313 -0.277409
C  3.403333 -0.752221 -0.976745
H  0.485596 0.825281 1.707289
H  0.45226 2.143417 -1.071095
H  1.119736 2.79965 0.443863
H  -1.132657 3.815738 0.035986
H  -1.235025 2.74521 1.453137
H  -2.163771 2.166417 -1.430783
H  -3.180072 2.243613 0.017632
H  0.286444 -1.987869 0.704656
H  -4.063096 0.012651 -0.732199
H  1.388295 -0.283803 -1.918199
H  2.828683 0.173443 2.079996
H  -1.669082 -3.477732 0.245327
H  -3.862791 -2.470307 -0.482626
H  4.040872 -1.166087 -1.754631
