program: Gaussian 09
title: 000124312
version: EM64L-G09RevD.01
frameworkgroup: C1[X(C21H18O7)]
method: RPBEPBE
basis: SDD
operation: Freq
keyword: #pfreq=noraman
keyword: PBEPBE/SDD
title: #p freq=noraman PBEPBE/SDD
converged: YES YES NO NO
title: Mulliken charges:
elementType: O O O O O O O C C C C C C C C C C C C C C C C C C C C C H H H H H H H H H H H H H H H H H H
charge: -0.192504 -0.213311 -0.262948 -0.265298 -0.265041 -0.280388 -0.266357 -0.321623 -0.147813 -0.410854 -0.668359 0.410656 -0.350964 0.403482 0.181029 0.530560 -0.576269 -0.598084 0.177817 0.178821 -0.577957 -0.542116 0.232068 0.230273 -0.006645 -0.205075 -0.197247 -0.512674 0.290087 0.256450 0.268464 0.254192 0.232312 0.233020 0.242975 0.273866 0.265384 0.273875 0.279630 0.242377 0.234043 0.241945 0.226754 0.237451 0.229971 0.234023
chargesum: 0.00000
title: Mulliken charges with hydrogens summed into heavy atoms:
elementType: O O O O O O O C C C C C C C C C C C C C C C C C C C C C
charge: -0.192504 -0.213311 -0.262948 -0.265298 -0.265041 -0.280388 -0.266357 -0.031536 0.108638 -0.142389 -0.181855 0.410656 0.125031 0.403482 0.181029 0.530560 -0.302404 -0.332701 0.177817 0.178821 -0.304081 -0.262486 0.232068 0.230273 -0.006645 0.271344 0.271451 0.188772
polarizability: 2.98329521e+02 -2.42504943e+01 2.42082307e+02 5.03204185e+00 -9.12469835e+00 1.95664401e+02
1716.lowfreq: -5.1082 -0.0005 -0.0005 0.0002 1.7746 5.6770 17.7439 24.9658 40.1061
frequency: 17.4385 24.9284 40.0996 43.0479 53.4259 61.1660 72.2082 106.9688 114.7712 141.0594 145.7505 158.5293 173.2989 179.2570 193.4632 203.8135 214.1678 248.5733 251.7278 268.6107 313.2439 326.4923 337.8605 346.3175 392.4429 409.0038 440.5070 449.5350 473.0901 506.3883 518.7172 546.1451 559.3499 561.9771 599.6174 621.4311 633.7386 654.8930 663.3997 675.2282 682.9336 698.0805 707.1884 713.6592 728.2781 765.5358 772.5293 779.8438 812.0456 834.1757 837.5044 844.6529 856.8632 867.0847 875.3748 881.6692 884.6944 910.0715 917.1560 938.8208 963.9768 966.3797 974.5385 992.7857 997.7530 1036.5811 1039.7014 1050.5705 1069.2961 1078.6254 1089.6821 1101.1845 1111.2363 1115.2093 1124.9570 1136.2991 1155.3808 1163.1543 1167.0305 1174.9632 1181.3224 1192.3926 1202.3487 1221.8279 1229.5748 1248.7231 1269.1405 1276.6792 1277.8574 1296.6197 1318.7802 1321.7106 1337.9546 1361.1898 1364.1506 1367.6660 1396.9023 1415.7391 1431.8177 1435.5737 1446.9194 1462.2040 1464.5802 1466.8489 1471.4785 1474.4956 1476.1590 1482.9243 1486.7879 1604.3409 1619.4908 1621.0399 1635.6018 1689.5805 2982.3889 2982.8404 2984.5458 2991.5189 3002.4141 3018.8430 3023.7897 3035.7052 3037.0902 3092.0685 3101.2822 3106.3788 3115.3834 3131.3260 3160.9077 3161.3770 3164.6095 3166.9887
redmass: 6.5082 5.4160 4.4832 3.7855 6.0673 4.4844 2.7974 6.7353 2.8563 4.6764 4.0178 4.1338 2.0822 5.4992 4.0104 3.2179 4.9004 5.9669 4.1296 5.7527 5.2696 2.7085 4.8257 5.6022 5.1455 4.5230 4.4761 4.9967 4.9214 6.6808 5.8946 6.6294 6.3658 5.4019 5.2964 5.9659 5.7507 8.0743 7.2468 8.5298 8.3546 8.0958 5.0197 4.3207 4.8275 5.2955 4.2409 5.0812 3.3440 3.4807 5.3281 5.1873 2.2472 1.7617 1.6091 1.5114 2.1087 2.8019 5.1075 4.6297 7.3092 3.2329 5.7487 3.9427 2.6752 3.9669 2.6863 2.6019 1.4843 1.5179 3.4012 3.2308 1.2530 2.8640 1.0540 1.0813 1.8582 1.6076 1.7271 1.4108 2.0164 1.2447 1.3829 1.2913 1.4226 1.4034 2.4957 4.8995 1.5219 1.5283 1.4970 1.5083 1.4400 1.2928 1.2739 1.5960 3.1493 5.0708 5.9781 4.1509 1.4223 1.0499 1.0551 1.2542 2.7459 1.6712 1.0936 1.1385 1.5533 8.7224 7.8639 9.2213 8.1745 12.6510 1.0641 1.0620 1.0824 1.0301 1.0598 1.0844 1.0608 1.0982 1.0870 1.1046 1.1076 1.1117 1.1063 1.1036 1.0922 1.0928 1.0914 1.0933
irintensity: 1.1596 1.1228 4.6516 3.5045 1.5157 2.4126 12.3702 1.1415 19.7288 2.1023 0.9950 0.9922 0.7262 1.2819 2.0596 2.2233 3.3916 2.7385 0.4016 0.8702 1.2604 0.3284 7.6901 2.2933 3.6676 4.4421 8.0594 7.2003 0.6263 1.9790 3.0061 6.1826 1.8562 0.5385 12.1209 2.9317 4.9549 1.3608 10.8271 0.4704 1.3635 3.9600 1.7303 10.5852 1.2597 2.4525 1.8075 17.9814 11.2790 30.9695 24.4526 27.3745 29.9642 5.1520 3.3745 33.6699 21.9868 0.1501 9.8231 4.7997 53.2860 14.4422 154.0011 170.5834 49.8899 80.2305 4.5210 39.4296 6.4288 11.9873 61.4812 117.9219 0.0752 74.9210 0.1199 2.5636 8.1800 47.7099 44.2611 22.5466 15.4061 13.0356 3.9196 4.6575 42.2464 22.4992 156.3367 100.0871 9.1416 46.5267 16.9492 17.7054 13.4956 1.6981 8.5839 27.1581 72.3014 1.7611 86.1859 1.3468 4.8718 13.1184 24.1400 27.2026 158.1263 92.5597 13.7307 1.6479 65.7583 83.7997 5.4116 2.0767 100.1523 254.4213 132.9178 26.7649 3.6635 60.9252 130.5894 14.5726 25.9840 35.7617 27.9751 33.3652 32.8580 30.9820 28.8268 22.1440 0.6332 4.0428 0.5207 0.6026
temp: 298.150 k
press: 1.00000 atm
elementType: 8 8 8 8 8 8 8 6 6 6 6 6 6 6 6 6 6 6 6 6 6 6 6 6 6 6 6 6 1 1 1 1 1 1 1 1 1 1 1 1 1 1 1 1 1 1
symmnumber: 1
zpe: 917350.5 jmol-1
zpe.correction: 0.349400 hartree
zpe.thermalcorrener: 0.372976 hartree
zpe.thermalcorrenthalpy: 0.373920 hartree
zpe.thermalcorrgfe: 0.294182 hartree
zpe.sumelectzpe: -1335.529368 hartree
zpe.sumelectthermal: -1335.505793 hartree
zpe.sumelectthermalent: -1335.504849 hartree
zpe.sumelectthermalfe: -1335.584586 hartree
dipole: -2.9878 -3.7109 4.5299
dipole: 6.5740
quadrupole: -137.9170 -169.5075 -160.3877
quadrupole: -9.4506 1.2058 16.3076
quadrupole: 18.0204 -13.5701 -4.4503 -9.4506 1.2058 16.3076
hfenergy: -1335.8787688 hartree
pointgroup: C01 [X(C21H18O7)]
dipole: -0.9317314 1.0005 -2.1955429 debye
polarizability: 301.6171033|20.7518158|232.4822291|-2.9226664|-17.1515314|201.9768962 unknown
InChI: InChI=1S/C21H18O7/c1-23-16-4-11(5-17-20(16)28-9-27-17)18-13-6-15-14(25-8-26-15)3-10(13)2-12-7-24-21(22)19(12)18/h3-6,12,18-19H,2,7-9H2,1H3
charge 0 multiplicity 1
46 atoms
O  2.358554 -3.714699 0.906311
O  0.992063 -3.187992 2.703921
O  3.886536 2.729274 1.616461
O  4.851196 2.375699 -0.553586
O  -4.737919 -0.506964 1.010077
O  -4.887091 1.256486 -0.594489
O  -2.254345 2.441534 -1.905613
C  0.456693 -2.292748 0.434839
C  1.194261 -2.544284 -0.914463
C  0.305869 -0.789565 0.877984
C  1.475786 -1.245228 -1.713921
C  1.527569 0.022054 0.466656
C  2.513059 -3.26882 -0.507685
C  2.097803 -0.184977 -0.820781
C  1.24998 -3.08157 1.493187
C  -1.037423 -0.197583 0.399195
C  2.066611 0.996062 1.353565
C  3.226169 0.571345 -1.247879
C  3.161797 1.73641 0.90865
C  3.729216 1.529347 -0.366524
C  -2.234981 -0.727739 0.970725
C  -1.111382 0.845698 -0.545382
C  -3.438562 -0.179429 0.535605
C  -2.351475 1.404648 -0.9750
C  -3.522014 0.859302 -0.418069
C  4.859248 3.274926 0.633026
C  -5.666498 0.197733 0.096627
C  -3.494353 3.06926 -2.398433
H  -0.555582 -2.734083 0.41603
H  0.585357 -3.221888 -1.53872
H  0.255371 -0.812101 1.985353
H  0.519092 -0.880431 -2.135751
H  2.135904 -1.468094 -2.573426
H  2.719015 -4.172106 -1.102974
H  3.383703 -2.59068 -0.535994
H  1.637331 1.155816 2.3464
H  3.678171 0.412233 -2.231018
H  -2.212276 -1.510725 1.734346
H  -0.202676 1.280485 -0.970982
H  5.864944 3.267168 1.080941
H  4.530001 4.283728 0.320965
H  -6.464193 0.671199 0.687592
H  -6.049372 -0.520143 -0.655777
H  -4.06221 3.529449 -1.57148
H  -4.133756 2.332412 -2.915514
H  -3.153593 3.84088 -3.104495
